{"text_format":"1","workbook":"xlsx","n_sheets":3,"sheets":["Parametrit","Asiakkaat","Matkalasku"],"not_rendered":{"charts":0,"images":0,"macros":0,"external_links":0,"defined_names":0,"comments":1,"pivot_tables":0},"unopened":[],"bounds":{"document_bytes":16777216,"sheet_cells":100000,"rows_first":2000,"rows_last":500,"rows_between":2000,"halvings":0,"cell_chars":16384,"cell_head_chars":4096},"cells_cut":0,"cells_raw":0,"read":"whole","date_system":"1900"}

{"sheet":"Parametrit","index":0,"n_rows":6,"n_cols":2,"rows_kept":6,"cut":false,"hidden":false,"merged":[]}
["Parametrit"]
["Lähtöosoite","Liikekatu 24"]
["Lähtöpaikka","TURKU"]
["½-Päiväraha",20]
["1-Päiväraha",43]
["Km-Raha",0.43]

{"sheet":"Asiakkaat","index":1,"n_rows":5,"n_cols":5,"rows_kept":5,"cut":false,"hidden":false,"merged":[]}
["Kohde","Lähtöpaikka","Osoite","Paikka","Km"]
["Firma Oy","Liikekatu 24","Firmatie 24","TURKU",1.6]
["Kauppa Oy","Liikekatu 24","Kauppakatu 61","TURKU",12.45]
["Tehdas Oy","Liikekatu 24","Tehdaskatu 34","TURKU",14.29]
["Yhtiö Oy","Liikekatu 24","Yhtiönkatu 6","HELSINKI",165.39]

{"sheet":"Matkalasku","index":2,"n_rows":159,"n_cols":14,"rows_kept":159,"cut":false,"hidden":false,"merged":[]}
[null,null,null,null,"Kilometrikorvaukset ja päivärahat"]
["Pvm","Vkpv","Lähtö","Kohde","Selite","Osoite","Paikka","Km","Km€","½pv","1pv","Pv€","Muu€","Summa"]
["2014-01-07",{"$f":"IF(A3<>\"\",IFERROR(WEEKDAY(A3),\"\"),\"\")","v":"1900-01-03"},{"$f":"IF(D3<>\"\",VLOOKUP(D3,Asiakkaat!$A$2:$E$244,2,FALSE),\"\")","v":"Liikekatu 24"},"Firma Oy",null,{"$f":"IF(D3<>\"\",VLOOKUP(D3,Asiakkaat!$A$2:$E$244,3,FALSE),\"\")","v":"Firmatie 24"},{"$f":"IF(D3<>\"\",VLOOKUP(D3,Asiakkaat!$A$2:$E$100,4,FALSE),\"\")","v":"TURKU"},{"$f":"IF(D3<>\"\",VLOOKUP(D3,Asiakkaat!$A$2:$E$394,5,FALSE)*2,\"\")","v":3.2},{"$f":"IF(D3<>\"\",H3*Parametrit!$B$6,\"\")","v":1.3760000000000001},null,null,{"$f":"IF((J3*Parametrit!$B$4)+(K3*Parametrit!$B$5)=0,\"\",(J3*Parametrit!$B$4)+(K3*Parametrit!$B$5))","v":""},null,{"$f":"IF(A3<>\"\",I3+(J3*Parametrit!$B$4)+(K3*Parametrit!$B$5)+M3,\"\")","v":1.3760000000000001}]
["2014-01-14","1900-01-03",{"$f":"IF(D4<>\"\",VLOOKUP(D4,Asiakkaat!$A$2:$E$244,2,FALSE),\"\")","v":"Liikekatu 24"},"Kauppa Oy",null,{"$f":"IF(D4<>\"\",VLOOKUP(D4,Asiakkaat!$A$2:$E$244,3,FALSE),\"\")","v":"Kauppakatu 61"},{"$f":"IF(D4<>\"\",VLOOKUP(D4,Asiakkaat!$A$2:$E$100,4,FALSE),\"\")","v":"TURKU"},{"$f":"IF(D4<>\"\",VLOOKUP(D4,Asiakkaat!$A$2:$E$394,5,FALSE)*2,\"\")","v":24.9},{"$f":"IF(D4<>\"\",H4*Parametrit!$B$6,\"\")","v":10.706999999999999},1,null,{"$f":"IF((J4*Parametrit!$B$4)+(K4*Parametrit!$B$5)=0,\"\",(J4*Parametrit!$B$4)+(K4*Parametrit!$B$5))","v":20},null,{"$f":"IF(A4<>\"\",I4+(J4*Parametrit!$B$4)+(K4*Parametrit!$B$5)+M4,\"\")","v":30.707000000000001}]
["2014-01-15","1900-01-04",{"$f":"IF(D5<>\"\",VLOOKUP(D5,Asiakkaat!$A$2:$E$244,2,FALSE),\"\")","v":"Liikekatu 24"},"Tehdas Oy",null,{"$f":"IF(D5<>\"\",VLOOKUP(D5,Asiakkaat!$A$2:$E$244,3,FALSE),\"\")","v":"Tehdaskatu 34"},{"$f":"IF(D5<>\"\",VLOOKUP(D5,Asiakkaat!$A$2:$E$100,4,FALSE),\"\")","v":"TURKU"},{"$f":"IF(D5<>\"\",VLOOKUP(D5,Asiakkaat!$A$2:$E$394,5,FALSE)*2,\"\")","v":28.58},{"$f":"IF(D5<>\"\",H5*Parametrit!$B$6,\"\")","v":12.289399999999999},null,null,{"$f":"IF((J5*Parametrit!$B$4)+(K5*Parametrit!$B$5)=0,\"\",(J5*Parametrit!$B$4)+(K5*Parametrit!$B$5))","v":""},null,{"$f":"IF(A5<>\"\",I5+(J5*Parametrit!$B$4)+(K5*Parametrit!$B$5)+M5,\"\")","v":12.289399999999999}]
["2014-01-15","1900-01-04",{"$f":"IF(D6<>\"\",VLOOKUP(D6,Asiakkaat!$A$2:$E$244,2,FALSE),\"\")","v":"Liikekatu 24"},"Yhtiö Oy",null,{"$f":"IF(D6<>\"\",VLOOKUP(D6,Asiakkaat!$A$2:$E$244,3,FALSE),\"\")","v":"Yhtiönkatu 6"},{"$f":"IF(D6<>\"\",VLOOKUP(D6,Asiakkaat!$A$2:$E$100,4,FALSE),\"\")","v":"HELSINKI"},{"$f":"IF(D6<>\"\",VLOOKUP(D6,Asiakkaat!$A$2:$E$394,5,FALSE)*2,\"\")","v":330.78},{"$f":"IF(D6<>\"\",H6*Parametrit!$B$6,\"\")","v":142.2354},null,2,{"$f":"IF((J6*Parametrit!$B$4)+(K6*Parametrit!$B$5)=0,\"\",(J6*Parametrit!$B$4)+(K6*Parametrit!$B$5))","v":86},null,{"$f":"IF(A6<>\"\",I6+(J6*Parametrit!$B$4)+(K6*Parametrit!$B$5)+M6,\"\")","v":228.2354}]
["2014-01-17","1900-01-06",{"$f":"IF(D7<>\"\",VLOOKUP(D7,Asiakkaat!$A$2:$E$244,2,FALSE),\"\")","v":"Liikekatu 24"},"Kauppa Oy",null,{"$f":"IF(D7<>\"\",VLOOKUP(D7,Asiakkaat!$A$2:$E$244,3,FALSE),\"\")","v":"Kauppakatu 61"},{"$f":"IF(D7<>\"\",VLOOKUP(D7,Asiakkaat!$A$2:$E$100,4,FALSE),\"\")","v":"TURKU"},{"$f":"IF(D7<>\"\",VLOOKUP(D7,Asiakkaat!$A$2:$E$394,5,FALSE)*2,\"\")","v":24.9},{"$f":"IF(D7<>\"\",H7*Parametrit!$B$6,\"\")","v":10.706999999999999},null,null,{"$f":"IF((J7*Parametrit!$B$4)+(K7*Parametrit!$B$5)=0,\"\",(J7*Parametrit!$B$4)+(K7*Parametrit!$B$5))","v":""},null,{"$f":"IF(A7<>\"\",I7+(J7*Parametrit!$B$4)+(K7*Parametrit!$B$5)+M7,\"\")","v":10.706999999999999}]
["2014-01-17","1900-01-06",{"$f":"IF(D8<>\"\",VLOOKUP(D8,Asiakkaat!$A$2:$E$244,2,FALSE),\"\")","v":"Liikekatu 24"},"Firma Oy",null,{"$f":"IF(D8<>\"\",VLOOKUP(D8,Asiakkaat!$A$2:$E$244,3,FALSE),\"\")","v":"Firmatie 24"},{"$f":"IF(D8<>\"\",VLOOKUP(D8,Asiakkaat!$A$2:$E$100,4,FALSE),\"\")","v":"TURKU"},{"$f":"IF(D8<>\"\",VLOOKUP(D8,Asiakkaat!$A$2:$E$394,5,FALSE)*2,\"\")","v":3.2},{"$f":"IF(D8<>\"\",H8*Parametrit!$B$6,\"\")","v":1.3760000000000001},null,null,{"$f":"IF((J8*Parametrit!$B$4)+(K8*Parametrit!$B$5)=0,\"\",(J8*Parametrit!$B$4)+(K8*Parametrit!$B$5))","v":""},null,{"$f":"IF(A8<>\"\",I8+(J8*Parametrit!$B$4)+(K8*Parametrit!$B$5)+M8,\"\")","v":1.3760000000000001}]
["2014-01-17","1900-01-06",{"$f":"IF(D9<>\"\",VLOOKUP(D9,Asiakkaat!$A$2:$E$244,2,FALSE),\"\")","v":"Liikekatu 24"},"Yhtiö Oy",null,{"$f":"IF(D9<>\"\",VLOOKUP(D9,Asiakkaat!$A$2:$E$244,3,FALSE),\"\")","v":"Yhtiönkatu 6"},{"$f":"IF(D9<>\"\",VLOOKUP(D9,Asiakkaat!$A$2:$E$100,4,FALSE),\"\")","v":"HELSINKI"},{"$f":"IF(D9<>\"\",VLOOKUP(D9,Asiakkaat!$A$2:$E$394,5,FALSE)*2,\"\")","v":330.78},{"$f":"IF(D9<>\"\",H9*Parametrit!$B$6,\"\")","v":142.2354},null,2,{"$f":"IF((J9*Parametrit!$B$4)+(K9*Parametrit!$B$5)=0,\"\",(J9*Parametrit!$B$4)+(K9*Parametrit!$B$5))","v":86},null,{"$f":"IF(A9<>\"\",I9+(J9*Parametrit!$B$4)+(K9*Parametrit!$B$5)+M9,\"\")","v":228.2354}]
["2014-01-21","1900-01-03",{"$f":"IF(D10<>\"\",VLOOKUP(D10,Asiakkaat!$A$2:$E$244,2,FALSE),\"\")","v":"Liikekatu 24"},"Tehdas Oy",null,{"$f":"IF(D10<>\"\",VLOOKUP(D10,Asiakkaat!$A$2:$E$244,3,FALSE),\"\")","v":"Tehdaskatu 34"},{"$f":"IF(D10<>\"\",VLOOKUP(D10,Asiakkaat!$A$2:$E$100,4,FALSE),\"\")","v":"TURKU"},{"$f":"IF(D10<>\"\",VLOOKUP(D10,Asiakkaat!$A$2:$E$394,5,FALSE)*2,\"\")","v":28.58},{"$f":"IF(D10<>\"\",H10*Parametrit!$B$6,\"\")","v":12.289399999999999},null,null,{"$f":"IF((J10*Parametrit!$B$4)+(K10*Parametrit!$B$5)=0,\"\",(J10*Parametrit!$B$4)+(K10*Parametrit!$B$5))","v":""},null,{"$f":"IF(A10<>\"\",I10+(J10*Parametrit!$B$4)+(K10*Parametrit!$B$5)+M10,\"\")","v":12.289399999999999}]
[null,"",{"$f":"IF(D11<>\"\",VLOOKUP(D11,Asiakkaat!$A$2:$E$244,2,FALSE),\"\")","v":""},null,null,{"$f":"IF(D11<>\"\",VLOOKUP(D11,Asiakkaat!$A$2:$E$244,3,FALSE),\"\")","v":""},{"$f":"IF(D11<>\"\",VLOOKUP(D11,Asiakkaat!$A$2:$E$100,4,FALSE),\"\")","v":""},{"$f":"IF(D11<>\"\",VLOOKUP(D11,Asiakkaat!$A$2:$E$394,5,FALSE)*2,\"\")","v":""},{"$f":"IF(D11<>\"\",H11*Parametrit!$B$6,\"\")","v":""},null,null,{"$f":"IF((J11*Parametrit!$B$4)+(K11*Parametrit!$B$5)=0,\"\",(J11*Parametrit!$B$4)+(K11*Parametrit!$B$5))","v":""},null,{"$f":"IF(A11<>\"\",I11+(J11*Parametrit!$B$4)+(K11*Parametrit!$B$5)+M11,\"\")","v":""}]
[null,"",{"$f":"IF(D12<>\"\",VLOOKUP(D12,Asiakkaat!$A$2:$E$244,2,FALSE),\"\")","v":""},null,null,{"$f":"IF(D12<>\"\",VLOOKUP(D12,Asiakkaat!$A$2:$E$244,3,FALSE),\"\")","v":""},{"$f":"IF(D12<>\"\",VLOOKUP(D12,Asiakkaat!$A$2:$E$100,4,FALSE),\"\")","v":""},{"$f":"IF(D12<>\"\",VLOOKUP(D12,Asiakkaat!$A$2:$E$394,5,FALSE)*2,\"\")","v":""},{"$f":"IF(D12<>\"\",H12*Parametrit!$B$6,\"\")","v":""},null,null,{"$f":"IF((J12*Parametrit!$B$4)+(K12*Parametrit!$B$5)=0,\"\",(J12*Parametrit!$B$4)+(K12*Parametrit!$B$5))","v":""},null,{"$f":"IF(A12<>\"\",I12+(J12*Parametrit!$B$4)+(K12*Parametrit!$B$5)+M12,\"\")","v":""}]
[null,"",{"$f":"IF(D13<>\"\",VLOOKUP(D13,Asiakkaat!$A$2:$E$244,2,FALSE),\"\")","v":""},null,null,{"$f":"IF(D13<>\"\",VLOOKUP(D13,Asiakkaat!$A$2:$E$244,3,FALSE),\"\")","v":""},{"$f":"IF(D13<>\"\",VLOOKUP(D13,Asiakkaat!$A$2:$E$100,4,FALSE),\"\")","v":""},{"$f":"IF(D13<>\"\",VLOOKUP(D13,Asiakkaat!$A$2:$E$394,5,FALSE)*2,\"\")","v":""},{"$f":"IF(H13<>\"\",H13*Parametrit!$B$6,\"\")","v":""},null,null,{"$f":"IF((J13*Parametrit!$B$4)+(K13*Parametrit!$B$5)=0,\"\",(J13*Parametrit!$B$4)+(K13*Parametrit!$B$5))","v":""},null,{"$f":"IF(A13<>\"\",I13+(J13*Parametrit!$B$4)+(K13*Parametrit!$B$5)+M13,\"\")","v":""}]
[null,"",{"$f":"IF(D14<>\"\",VLOOKUP(D14,Asiakkaat!$A$2:$E$244,2,FALSE),\"\")","v":""},null,null,{"$f":"IF(D14<>\"\",VLOOKUP(D14,Asiakkaat!$A$2:$E$244,3,FALSE),\"\")","v":""},{"$f":"IF(D14<>\"\",VLOOKUP(D14,Asiakkaat!$A$2:$E$100,4,FALSE),\"\")","v":""},{"$f":"IF(D14<>\"\",VLOOKUP(D14,Asiakkaat!$A$2:$E$394,5,FALSE)*2,\"\")","v":""},{"$f":"IF(D14<>\"\",H14*Parametrit!$B$6,\"\")","v":""},null,null,{"$f":"IF((J14*Parametrit!$B$4)+(K14*Parametrit!$B$5)=0,\"\",(J14*Parametrit!$B$4)+(K14*Parametrit!$B$5))","v":""},null,{"$f":"IF(A14<>\"\",I14+(J14*Parametrit!$B$4)+(K14*Parametrit!$B$5)+M14,\"\")","v":""}]
[null,"",{"$f":"IF(D15<>\"\",VLOOKUP(D15,Asiakkaat!$A$2:$E$244,2,FALSE),\"\")","v":""},null,null,{"$f":"IF(D15<>\"\",VLOOKUP(D15,Asiakkaat!$A$2:$E$244,3,FALSE),\"\")","v":""},{"$f":"IF(D15<>\"\",VLOOKUP(D15,Asiakkaat!$A$2:$E$100,4,FALSE),\"\")","v":""},{"$f":"IF(D15<>\"\",VLOOKUP(D15,Asiakkaat!$A$2:$E$394,5,FALSE)*2,\"\")","v":""},{"$f":"IF(D15<>\"\",H15*Parametrit!$B$6,\"\")","v":""},null,null,{"$f":"IF((J15*Parametrit!$B$4)+(K15*Parametrit!$B$5)=0,\"\",(J15*Parametrit!$B$4)+(K15*Parametrit!$B$5))","v":""},null,{"$f":"IF(A15<>\"\",I15+(J15*Parametrit!$B$4)+(K15*Parametrit!$B$5)+M15,\"\")","v":""}]
[null,"",{"$f":"IF(D16<>\"\",VLOOKUP(D16,Asiakkaat!$A$2:$E$244,2,FALSE),\"\")","v":""},null,null,{"$f":"IF(D16<>\"\",VLOOKUP(D16,Asiakkaat!$A$2:$E$244,3,FALSE),\"\")","v":""},{"$f":"IF(D16<>\"\",VLOOKUP(D16,Asiakkaat!$A$2:$E$100,4,FALSE),\"\")","v":""},{"$f":"IF(D16<>\"\",VLOOKUP(D16,Asiakkaat!$A$2:$E$394,5,FALSE)*2,\"\")","v":""},{"$f":"IFERROR(H16*Parametrit!$B$6,\"\")","v":""},null,null,{"$f":"IF((J16*Parametrit!$B$4)+(K16*Parametrit!$B$5)=0,\"\",(J16*Parametrit!$B$4)+(K16*Parametrit!$B$5))","v":""},null,{"$f":"IF(A16<>\"\",I16+(J16*Parametrit!$B$4)+(K16*Parametrit!$B$5)+M16,\"\")","v":""}]
[null,"",{"$f":"IF(D17<>\"\",VLOOKUP(D17,Asiakkaat!$A$2:$E$244,2,FALSE),\"\")","v":""},null,null,{"$f":"IF(D17<>\"\",VLOOKUP(D17,Asiakkaat!$A$2:$E$244,3,FALSE),\"\")","v":""},{"$f":"IF(D17<>\"\",VLOOKUP(D17,Asiakkaat!$A$2:$E$100,4,FALSE),\"\")","v":""},{"$f":"IF(D17<>\"\",VLOOKUP(D17,Asiakkaat!$A$2:$E$394,5,FALSE)*2,\"\")","v":""},{"$f":"IF(D17<>\"\",H17*Parametrit!$B$6,\"\")","v":""},null,null,{"$f":"IF((J17*Parametrit!$B$4)+(K17*Parametrit!$B$5)=0,\"\",(J17*Parametrit!$B$4)+(K17*Parametrit!$B$5))","v":""},null,{"$f":"IF(A17<>\"\",I17+(J17*Parametrit!$B$4)+(K17*Parametrit!$B$5)+M17,\"\")","v":""}]
[null,"",{"$f":"IF(D18<>\"\",VLOOKUP(D18,Asiakkaat!$A$2:$E$244,2,FALSE),\"\")","v":""},null,null,{"$f":"IF(D18<>\"\",VLOOKUP(D18,Asiakkaat!$A$2:$E$244,3,FALSE),\"\")","v":""},{"$f":"IF(D18<>\"\",VLOOKUP(D18,Asiakkaat!$A$2:$E$100,4,FALSE),\"\")","v":""},{"$f":"IF(D18<>\"\",VLOOKUP(D18,Asiakkaat!$A$2:$E$394,5,FALSE)*2,\"\")","v":""},{"$f":"IF(D18<>\"\",H18*Parametrit!$B$6,\"\")","v":""},null,null,{"$f":"IF((J18*Parametrit!$B$4)+(K18*Parametrit!$B$5)=0,\"\",(J18*Parametrit!$B$4)+(K18*Parametrit!$B$5))","v":""},null,{"$f":"IF(A18<>\"\",I18+(J18*Parametrit!$B$4)+(K18*Parametrit!$B$5)+M18,\"\")","v":""}]
[null,"",{"$f":"IF(D19<>\"\",VLOOKUP(D19,Asiakkaat!$A$2:$E$244,2,FALSE),\"\")","v":""},null,null,{"$f":"IF(D19<>\"\",VLOOKUP(D19,Asiakkaat!$A$2:$E$244,3,FALSE),\"\")","v":""},{"$f":"IF(D19<>\"\",VLOOKUP(D19,Asiakkaat!$A$2:$E$100,4,FALSE),\"\")","v":""},{"$f":"IF(D19<>\"\",VLOOKUP(D19,Asiakkaat!$A$2:$E$394,5,FALSE)*2,\"\")","v":""},{"$f":"IF(D19<>\"\",H19*Parametrit!$B$6,\"\")","v":""},null,null,{"$f":"IF((J19*Parametrit!$B$4)+(K19*Parametrit!$B$5)=0,\"\",(J19*Parametrit!$B$4)+(K19*Parametrit!$B$5))","v":""},null,{"$f":"IF(A19<>\"\",I19+(J19*Parametrit!$B$4)+(K19*Parametrit!$B$5)+M19,\"\")","v":""}]
[null,"",{"$f":"IF(D20<>\"\",VLOOKUP(D20,Asiakkaat!$A$2:$E$244,2,FALSE),\"\")","v":""},null,null,{"$f":"IF(D20<>\"\",VLOOKUP(D20,Asiakkaat!$A$2:$E$244,3,FALSE),\"\")","v":""},{"$f":"IF(D20<>\"\",VLOOKUP(D20,Asiakkaat!$A$2:$E$100,4,FALSE),\"\")","v":""},{"$f":"IF(D20<>\"\",VLOOKUP(D20,Asiakkaat!$A$2:$E$394,5,FALSE)*2,\"\")","v":""},{"$f":"IF(D20<>\"\",H20*Parametrit!$B$6,\"\")","v":""},null,null,{"$f":"IF((J20*Parametrit!$B$4)+(K20*Parametrit!$B$5)=0,\"\",(J20*Parametrit!$B$4)+(K20*Parametrit!$B$5))","v":""},null,{"$f":"IF(A20<>\"\",I20+(J20*Parametrit!$B$4)+(K20*Parametrit!$B$5)+M20,\"\")","v":""}]
[null,"",{"$f":"IF(D21<>\"\",VLOOKUP(D21,Asiakkaat!$A$2:$E$244,2,FALSE),\"\")","v":""},null,null,{"$f":"IF(D21<>\"\",VLOOKUP(D21,Asiakkaat!$A$2:$E$244,3,FALSE),\"\")","v":""},{"$f":"IF(D21<>\"\",VLOOKUP(D21,Asiakkaat!$A$2:$E$100,4,FALSE),\"\")","v":""},{"$f":"IF(D21<>\"\",VLOOKUP(D21,Asiakkaat!$A$2:$E$394,5,FALSE)*2,\"\")","v":""},{"$f":"IF(D21<>\"\",H21*Parametrit!$B$6,\"\")","v":""},null,null,{"$f":"IF((J21*Parametrit!$B$4)+(K21*Parametrit!$B$5)=0,\"\",(J21*Parametrit!$B$4)+(K21*Parametrit!$B$5))","v":""},null,{"$f":"IF(A21<>\"\",I21+(J21*Parametrit!$B$4)+(K21*Parametrit!$B$5)+M21,\"\")","v":""}]
[null,"",{"$f":"IF(D22<>\"\",VLOOKUP(D22,Asiakkaat!$A$2:$E$244,2,FALSE),\"\")","v":""},null,null,{"$f":"IF(D22<>\"\",VLOOKUP(D22,Asiakkaat!$A$2:$E$244,3,FALSE),\"\")","v":""},{"$f":"IF(D22<>\"\",VLOOKUP(D22,Asiakkaat!$A$2:$E$100,4,FALSE),\"\")","v":""},{"$f":"IF(D22<>\"\",VLOOKUP(D22,Asiakkaat!$A$2:$E$394,5,FALSE)*2,\"\")","v":""},{"$f":"IF(D22<>\"\",H22*Parametrit!$B$6,\"\")","v":""},null,null,{"$f":"IF((J22*Parametrit!$B$4)+(K22*Parametrit!$B$5)=0,\"\",(J22*Parametrit!$B$4)+(K22*Parametrit!$B$5))","v":""},null,{"$f":"IF(A22<>\"\",I22+(J22*Parametrit!$B$4)+(K22*Parametrit!$B$5)+M22,\"\")","v":""}]
[null,{"$f":"IF(A23<>\"\",IFERROR(WEEKDAY(A23),\"\"),\"\")","v":""},{"$f":"IF(D23<>\"\",VLOOKUP(D23,Asiakkaat!$A$2:$E$244,2,FALSE),\"\")","v":""},null,null,{"$f":"IF(D23<>\"\",VLOOKUP(D23,Asiakkaat!$A$2:$E$244,3,FALSE),\"\")","v":""},{"$f":"IF(D23<>\"\",VLOOKUP(D23,Asiakkaat!$A$2:$E$100,4,FALSE),\"\")","v":""},{"$f":"IF(D23<>\"\",VLOOKUP(D23,Asiakkaat!$A$2:$E$394,5,FALSE)*2,\"\")","v":""},{"$f":"IF(D23<>\"\",H23*Parametrit!$B$6,\"\")","v":""},null,null,{"$f":"IF((J23*Parametrit!$B$4)+(K23*Parametrit!$B$5)=0,\"\",(J23*Parametrit!$B$4)+(K23*Parametrit!$B$5))","v":""},null,{"$f":"IF(A23<>\"\",I23+(J23*Parametrit!$B$4)+(K23*Parametrit!$B$5)+M23,\"\")","v":""}]
[null,"",{"$f":"IF(D24<>\"\",VLOOKUP(D24,Asiakkaat!$A$2:$E$244,2,FALSE),\"\")","v":""},null,null,{"$f":"IF(D24<>\"\",VLOOKUP(D24,Asiakkaat!$A$2:$E$244,3,FALSE),\"\")","v":""},{"$f":"IF(D24<>\"\",VLOOKUP(D24,Asiakkaat!$A$2:$E$100,4,FALSE),\"\")","v":""},{"$f":"IF(D24<>\"\",VLOOKUP(D24,Asiakkaat!$A$2:$E$394,5,FALSE)*2,\"\")","v":""},{"$f":"IF(D24<>\"\",H24*Parametrit!$B$6,\"\")","v":""},null,null,{"$f":"IF((J24*Parametrit!$B$4)+(K24*Parametrit!$B$5)=0,\"\",(J24*Parametrit!$B$4)+(K24*Parametrit!$B$5))","v":""},null,{"$f":"IF(A24<>\"\",I24+(J24*Parametrit!$B$4)+(K24*Parametrit!$B$5)+M24,\"\")","v":""}]
[null,"",{"$f":"IF(D25<>\"\",VLOOKUP(D25,Asiakkaat!$A$2:$E$244,2,FALSE),\"\")","v":""},null,null,{"$f":"IF(D25<>\"\",VLOOKUP(D25,Asiakkaat!$A$2:$E$244,3,FALSE),\"\")","v":""},{"$f":"IF(D25<>\"\",VLOOKUP(D25,Asiakkaat!$A$2:$E$100,4,FALSE),\"\")","v":""},{"$f":"IF(D25<>\"\",VLOOKUP(D25,Asiakkaat!$A$2:$E$394,5,FALSE)*2,\"\")","v":""},{"$f":"IF(D25<>\"\",H25*Parametrit!$B$6,\"\")","v":""},null,null,{"$f":"IF((J25*Parametrit!$B$4)+(K25*Parametrit!$B$5)=0,\"\",(J25*Parametrit!$B$4)+(K25*Parametrit!$B$5))","v":""},null,{"$f":"IF(A25<>\"\",I25+(J25*Parametrit!$B$4)+(K25*Parametrit!$B$5)+M25,\"\")","v":""}]
[null,"",{"$f":"IF(D26<>\"\",VLOOKUP(D26,Asiakkaat!$A$2:$E$244,2,FALSE),\"\")","v":""},null,null,{"$f":"IF(D26<>\"\",VLOOKUP(D26,Asiakkaat!$A$2:$E$244,3,FALSE),\"\")","v":""},{"$f":"IF(D26<>\"\",VLOOKUP(D26,Asiakkaat!$A$2:$E$100,4,FALSE),\"\")","v":""},{"$f":"IF(D26<>\"\",VLOOKUP(D26,Asiakkaat!$A$2:$E$394,5,FALSE)*2,\"\")","v":""},{"$f":"IF(D26<>\"\",H26*Parametrit!$B$6,\"\")","v":""},null,null,{"$f":"IF((J26*Parametrit!$B$4)+(K26*Parametrit!$B$5)=0,\"\",(J26*Parametrit!$B$4)+(K26*Parametrit!$B$5))","v":""},null,{"$f":"IF(A26<>\"\",I26+(J26*Parametrit!$B$4)+(K26*Parametrit!$B$5)+M26,\"\")","v":""}]
[null,"",{"$f":"IF(D27<>\"\",VLOOKUP(D27,Asiakkaat!$A$2:$E$244,2,FALSE),\"\")","v":""},null,null,{"$f":"IF(D27<>\"\",VLOOKUP(D27,Asiakkaat!$A$2:$E$244,3,FALSE),\"\")","v":""},{"$f":"IF(D27<>\"\",VLOOKUP(D27,Asiakkaat!$A$2:$E$100,4,FALSE),\"\")","v":""},{"$f":"IF(D27<>\"\",VLOOKUP(D27,Asiakkaat!$A$2:$E$394,5,FALSE)*2,\"\")","v":""},{"$f":"IF(D27<>\"\",H27*Parametrit!$B$6,\"\")","v":""},null,null,{"$f":"IF((J27*Parametrit!$B$4)+(K27*Parametrit!$B$5)=0,\"\",(J27*Parametrit!$B$4)+(K27*Parametrit!$B$5))","v":""},null,{"$f":"IF(A27<>\"\",I27+(J27*Parametrit!$B$4)+(K27*Parametrit!$B$5)+M27,\"\")","v":""}]
[null,"",{"$f":"IF(D28<>\"\",VLOOKUP(D28,Asiakkaat!$A$2:$E$244,2,FALSE),\"\")","v":""},null,null,{"$f":"IF(D28<>\"\",VLOOKUP(D28,Asiakkaat!$A$2:$E$244,3,FALSE),\"\")","v":""},{"$f":"IF(D28<>\"\",VLOOKUP(D28,Asiakkaat!$A$2:$E$100,4,FALSE),\"\")","v":""},{"$f":"IF(D28<>\"\",VLOOKUP(D28,Asiakkaat!$A$2:$E$394,5,FALSE)*2,\"\")","v":""},{"$f":"IF(D28<>\"\",H28*Parametrit!$B$6,\"\")","v":""},null,null,{"$f":"IF((J28*Parametrit!$B$4)+(K28*Parametrit!$B$5)=0,\"\",(J28*Parametrit!$B$4)+(K28*Parametrit!$B$5))","v":""},null,{"$f":"IF(A28<>\"\",I28+(J28*Parametrit!$B$4)+(K28*Parametrit!$B$5)+M28,\"\")","v":""}]
[null,"",{"$f":"IF(D29<>\"\",VLOOKUP(D29,Asiakkaat!$A$2:$E$244,2,FALSE),\"\")","v":""},null,null,{"$f":"IF(D29<>\"\",VLOOKUP(D29,Asiakkaat!$A$2:$E$244,3,FALSE),\"\")","v":""},{"$f":"IF(D29<>\"\",VLOOKUP(D29,Asiakkaat!$A$2:$E$100,4,FALSE),\"\")","v":""},{"$f":"IF(D29<>\"\",VLOOKUP(D29,Asiakkaat!$A$2:$E$394,5,FALSE)*2,\"\")","v":""},{"$f":"IF(D29<>\"\",H29*Parametrit!$B$6,\"\")","v":""},null,null,{"$f":"IF((J29*Parametrit!$B$4)+(K29*Parametrit!$B$5)=0,\"\",(J29*Parametrit!$B$4)+(K29*Parametrit!$B$5))","v":""},null,{"$f":"IF(A29<>\"\",I29+(J29*Parametrit!$B$4)+(K29*Parametrit!$B$5)+M29,\"\")","v":""}]
[null,"",{"$f":"IF(D30<>\"\",VLOOKUP(D30,Asiakkaat!$A$2:$E$244,2,FALSE),\"\")","v":""},null,null,{"$f":"IF(D30<>\"\",VLOOKUP(D30,Asiakkaat!$A$2:$E$244,3,FALSE),\"\")","v":""},{"$f":"IF(D30<>\"\",VLOOKUP(D30,Asiakkaat!$A$2:$E$100,4,FALSE),\"\")","v":""},{"$f":"IF(D30<>\"\",VLOOKUP(D30,Asiakkaat!$A$2:$E$394,5,FALSE)*2,\"\")","v":""},{"$f":"IF(D30<>\"\",H30*Parametrit!$B$6,\"\")","v":""},null,null,{"$f":"IF((J30*Parametrit!$B$4)+(K30*Parametrit!$B$5)=0,\"\",(J30*Parametrit!$B$4)+(K30*Parametrit!$B$5))","v":""},null,{"$f":"IF(A30<>\"\",I30+(J30*Parametrit!$B$4)+(K30*Parametrit!$B$5)+M30,\"\")","v":""}]
[null,"",{"$f":"IF(D31<>\"\",VLOOKUP(D31,Asiakkaat!$A$2:$E$244,2,FALSE),\"\")","v":""},null,null,{"$f":"IF(D31<>\"\",VLOOKUP(D31,Asiakkaat!$A$2:$E$244,3,FALSE),\"\")","v":""},{"$f":"IF(D31<>\"\",VLOOKUP(D31,Asiakkaat!$A$2:$E$100,4,FALSE),\"\")","v":""},{"$f":"IF(D31<>\"\",VLOOKUP(D31,Asiakkaat!$A$2:$E$394,5,FALSE)*2,\"\")","v":""},{"$f":"IF(D31<>\"\",H31*Parametrit!$B$6,\"\")","v":""},null,null,{"$f":"IF((J31*Parametrit!$B$4)+(K31*Parametrit!$B$5)=0,\"\",(J31*Parametrit!$B$4)+(K31*Parametrit!$B$5))","v":""},null,{"$f":"IF(A31<>\"\",I31+(J31*Parametrit!$B$4)+(K31*Parametrit!$B$5)+M31,\"\")","v":""}]
[null,"",{"$f":"IF(D32<>\"\",VLOOKUP(D32,Asiakkaat!$A$2:$E$244,2,FALSE),\"\")","v":""},null,null,{"$f":"IF(D32<>\"\",VLOOKUP(D32,Asiakkaat!$A$2:$E$244,3,FALSE),\"\")","v":""},{"$f":"IF(D32<>\"\",VLOOKUP(D32,Asiakkaat!$A$2:$E$100,4,FALSE),\"\")","v":""},{"$f":"IF(D32<>\"\",VLOOKUP(D32,Asiakkaat!$A$2:$E$394,5,FALSE)*2,\"\")","v":""},{"$f":"IF(D32<>\"\",H32*Parametrit!$B$6,\"\")","v":""},null,null,{"$f":"IF((J32*Parametrit!$B$4)+(K32*Parametrit!$B$5)=0,\"\",(J32*Parametrit!$B$4)+(K32*Parametrit!$B$5))","v":""},null,{"$f":"IF(A32<>\"\",I32+(J32*Parametrit!$B$4)+(K32*Parametrit!$B$5)+M32,\"\")","v":""}]
[null,"",{"$f":"IF(D33<>\"\",VLOOKUP(D33,Asiakkaat!$A$2:$E$244,2,FALSE),\"\")","v":""},null,null,{"$f":"IF(D33<>\"\",VLOOKUP(D33,Asiakkaat!$A$2:$E$244,3,FALSE),\"\")","v":""},{"$f":"IF(D33<>\"\",VLOOKUP(D33,Asiakkaat!$A$2:$E$100,4,FALSE),\"\")","v":""},{"$f":"IF(D33<>\"\",VLOOKUP(D33,Asiakkaat!$A$2:$E$394,5,FALSE)*2,\"\")","v":""},{"$f":"IF(D33<>\"\",H33*Parametrit!$B$6,\"\")","v":""},null,null,{"$f":"IF((J33*Parametrit!$B$4)+(K33*Parametrit!$B$5)=0,\"\",(J33*Parametrit!$B$4)+(K33*Parametrit!$B$5))","v":""},null,{"$f":"IF(A33<>\"\",I33+(J33*Parametrit!$B$4)+(K33*Parametrit!$B$5)+M33,\"\")","v":""}]
[null,"",{"$f":"IF(D34<>\"\",VLOOKUP(D34,Asiakkaat!$A$2:$E$244,2,FALSE),\"\")","v":""},null,null,{"$f":"IF(D34<>\"\",VLOOKUP(D34,Asiakkaat!$A$2:$E$244,3,FALSE),\"\")","v":""},{"$f":"IF(D34<>\"\",VLOOKUP(D34,Asiakkaat!$A$2:$E$100,4,FALSE),\"\")","v":""},{"$f":"IF(D34<>\"\",VLOOKUP(D34,Asiakkaat!$A$2:$E$394,5,FALSE)*2,\"\")","v":""},{"$f":"IF(D34<>\"\",H34*Parametrit!$B$6,\"\")","v":""},null,null,{"$f":"IF((J34*Parametrit!$B$4)+(K34*Parametrit!$B$5)=0,\"\",(J34*Parametrit!$B$4)+(K34*Parametrit!$B$5))","v":""},null,{"$f":"IF(A34<>\"\",I34+(J34*Parametrit!$B$4)+(K34*Parametrit!$B$5)+M34,\"\")","v":""}]
[null,{"$f":"IF(A35<>\"\",IFERROR(WEEKDAY(A35),\"\"),\"\")","v":""},{"$f":"IF(D35<>\"\",VLOOKUP(D35,Asiakkaat!$A$2:$E$244,2,FALSE),\"\")","v":""},null,null,{"$f":"IF(D35<>\"\",VLOOKUP(D35,Asiakkaat!$A$2:$E$244,3,FALSE),\"\")","v":""},{"$f":"IF(D35<>\"\",VLOOKUP(D35,Asiakkaat!$A$2:$E$100,4,FALSE),\"\")","v":""},{"$f":"IF(D35<>\"\",VLOOKUP(D35,Asiakkaat!$A$2:$E$394,5,FALSE)*2,\"\")","v":""},{"$f":"IF(D35<>\"\",H35*Parametrit!$B$6,\"\")","v":""},null,null,{"$f":"IF((J35*Parametrit!$B$4)+(K35*Parametrit!$B$5)=0,\"\",(J35*Parametrit!$B$4)+(K35*Parametrit!$B$5))","v":""},null,{"$f":"IF(A35<>\"\",I35+(J35*Parametrit!$B$4)+(K35*Parametrit!$B$5)+M35,\"\")","v":""}]
[null,"",{"$f":"IF(D36<>\"\",VLOOKUP(D36,Asiakkaat!$A$2:$E$244,2,FALSE),\"\")","v":""},null,null,{"$f":"IF(D36<>\"\",VLOOKUP(D36,Asiakkaat!$A$2:$E$244,3,FALSE),\"\")","v":""},{"$f":"IF(D36<>\"\",VLOOKUP(D36,Asiakkaat!$A$2:$E$100,4,FALSE),\"\")","v":""},{"$f":"IF(D36<>\"\",VLOOKUP(D36,Asiakkaat!$A$2:$E$394,5,FALSE)*2,\"\")","v":""},{"$f":"IF(D36<>\"\",H36*Parametrit!$B$6,\"\")","v":""},null,null,{"$f":"IF((J36*Parametrit!$B$4)+(K36*Parametrit!$B$5)=0,\"\",(J36*Parametrit!$B$4)+(K36*Parametrit!$B$5))","v":""},null,{"$f":"IF(A36<>\"\",I36+(J36*Parametrit!$B$4)+(K36*Parametrit!$B$5)+M36,\"\")","v":""}]
[null,"",{"$f":"IF(D37<>\"\",VLOOKUP(D37,Asiakkaat!$A$2:$E$244,2,FALSE),\"\")","v":""},null,null,{"$f":"IF(D37<>\"\",VLOOKUP(D37,Asiakkaat!$A$2:$E$244,3,FALSE),\"\")","v":""},{"$f":"IF(D37<>\"\",VLOOKUP(D37,Asiakkaat!$A$2:$E$100,4,FALSE),\"\")","v":""},{"$f":"IF(D37<>\"\",VLOOKUP(D37,Asiakkaat!$A$2:$E$394,5,FALSE)*2,\"\")","v":""},{"$f":"IF(D37<>\"\",H37*Parametrit!$B$6,\"\")","v":""},null,null,{"$f":"IF((J37*Parametrit!$B$4)+(K37*Parametrit!$B$5)=0,\"\",(J37*Parametrit!$B$4)+(K37*Parametrit!$B$5))","v":""},null,{"$f":"IF(A37<>\"\",I37+(J37*Parametrit!$B$4)+(K37*Parametrit!$B$5)+M37,\"\")","v":""}]
[null,"",{"$f":"IF(D38<>\"\",VLOOKUP(D38,Asiakkaat!$A$2:$E$244,2,FALSE),\"\")","v":""},null,null,{"$f":"IF(D38<>\"\",VLOOKUP(D38,Asiakkaat!$A$2:$E$244,3,FALSE),\"\")","v":""},{"$f":"IF(D38<>\"\",VLOOKUP(D38,Asiakkaat!$A$2:$E$100,4,FALSE),\"\")","v":""},{"$f":"IF(D38<>\"\",VLOOKUP(D38,Asiakkaat!$A$2:$E$394,5,FALSE)*2,\"\")","v":""},{"$f":"IF(D38<>\"\",H38*Parametrit!$B$6,\"\")","v":""},null,null,{"$f":"IF((J38*Parametrit!$B$4)+(K38*Parametrit!$B$5)=0,\"\",(J38*Parametrit!$B$4)+(K38*Parametrit!$B$5))","v":""},null,{"$f":"IF(A38<>\"\",I38+(J38*Parametrit!$B$4)+(K38*Parametrit!$B$5)+M38,\"\")","v":""}]
[null,"",{"$f":"IF(D39<>\"\",VLOOKUP(D39,Asiakkaat!$A$2:$E$244,2,FALSE),\"\")","v":""},null,null,{"$f":"IF(D39<>\"\",VLOOKUP(D39,Asiakkaat!$A$2:$E$244,3,FALSE),\"\")","v":""},{"$f":"IF(D39<>\"\",VLOOKUP(D39,Asiakkaat!$A$2:$E$100,4,FALSE),\"\")","v":""},{"$f":"IF(D39<>\"\",VLOOKUP(D39,Asiakkaat!$A$2:$E$394,5,FALSE)*2,\"\")","v":""},{"$f":"IF(D39<>\"\",H39*Parametrit!$B$6,\"\")","v":""},null,null,{"$f":"IF((J39*Parametrit!$B$4)+(K39*Parametrit!$B$5)=0,\"\",(J39*Parametrit!$B$4)+(K39*Parametrit!$B$5))","v":""},null,{"$f":"IF(A39<>\"\",I39+(J39*Parametrit!$B$4)+(K39*Parametrit!$B$5)+M39,\"\")","v":""}]
[null,"",{"$f":"IF(D40<>\"\",VLOOKUP(D40,Asiakkaat!$A$2:$E$244,2,FALSE),\"\")","v":""},null,null,{"$f":"IF(D40<>\"\",VLOOKUP(D40,Asiakkaat!$A$2:$E$244,3,FALSE),\"\")","v":""},{"$f":"IF(D40<>\"\",VLOOKUP(D40,Asiakkaat!$A$2:$E$100,4,FALSE),\"\")","v":""},{"$f":"IF(D40<>\"\",VLOOKUP(D40,Asiakkaat!$A$2:$E$394,5,FALSE)*2,\"\")","v":""},{"$f":"IF(D40<>\"\",H40*Parametrit!$B$6,\"\")","v":""},null,null,{"$f":"IF((J40*Parametrit!$B$4)+(K40*Parametrit!$B$5)=0,\"\",(J40*Parametrit!$B$4)+(K40*Parametrit!$B$5))","v":""},null,{"$f":"IF(A40<>\"\",I40+(J40*Parametrit!$B$4)+(K40*Parametrit!$B$5)+M40,\"\")","v":""}]
[null,"",{"$f":"IF(D41<>\"\",VLOOKUP(D41,Asiakkaat!$A$2:$E$244,2,FALSE),\"\")","v":""},null,null,{"$f":"IF(D41<>\"\",VLOOKUP(D41,Asiakkaat!$A$2:$E$244,3,FALSE),\"\")","v":""},{"$f":"IF(D41<>\"\",VLOOKUP(D41,Asiakkaat!$A$2:$E$100,4,FALSE),\"\")","v":""},{"$f":"IF(D41<>\"\",VLOOKUP(D41,Asiakkaat!$A$2:$E$394,5,FALSE)*2,\"\")","v":""},{"$f":"IF(D41<>\"\",H41*Parametrit!$B$6,\"\")","v":""},null,null,{"$f":"IF((J41*Parametrit!$B$4)+(K41*Parametrit!$B$5)=0,\"\",(J41*Parametrit!$B$4)+(K41*Parametrit!$B$5))","v":""},null,{"$f":"IF(A41<>\"\",I41+(J41*Parametrit!$B$4)+(K41*Parametrit!$B$5)+M41,\"\")","v":""}]
[null,"",{"$f":"IF(D42<>\"\",VLOOKUP(D42,Asiakkaat!$A$2:$E$244,2,FALSE),\"\")","v":""},null,null,{"$f":"IF(D42<>\"\",VLOOKUP(D42,Asiakkaat!$A$2:$E$244,3,FALSE),\"\")","v":""},{"$f":"IF(D42<>\"\",VLOOKUP(D42,Asiakkaat!$A$2:$E$100,4,FALSE),\"\")","v":""},{"$f":"IF(D42<>\"\",VLOOKUP(D42,Asiakkaat!$A$2:$E$394,5,FALSE)*2,\"\")","v":""},{"$f":"IF(D42<>\"\",H42*Parametrit!$B$6,\"\")","v":""},null,null,{"$f":"IF((J42*Parametrit!$B$4)+(K42*Parametrit!$B$5)=0,\"\",(J42*Parametrit!$B$4)+(K42*Parametrit!$B$5))","v":""},null,{"$f":"IF(A42<>\"\",I42+(J42*Parametrit!$B$4)+(K42*Parametrit!$B$5)+M42,\"\")","v":""}]
[null,"",{"$f":"IF(D43<>\"\",VLOOKUP(D43,Asiakkaat!$A$2:$E$244,2,FALSE),\"\")","v":""},null,null,{"$f":"IF(D43<>\"\",VLOOKUP(D43,Asiakkaat!$A$2:$E$244,3,FALSE),\"\")","v":""},{"$f":"IF(D43<>\"\",VLOOKUP(D43,Asiakkaat!$A$2:$E$100,4,FALSE),\"\")","v":""},{"$f":"IF(D43<>\"\",VLOOKUP(D43,Asiakkaat!$A$2:$E$394,5,FALSE)*2,\"\")","v":""},{"$f":"IF(D43<>\"\",H43*Parametrit!$B$6,\"\")","v":""},null,null,{"$f":"IF((J43*Parametrit!$B$4)+(K43*Parametrit!$B$5)=0,\"\",(J43*Parametrit!$B$4)+(K43*Parametrit!$B$5))","v":""},null,{"$f":"IF(A43<>\"\",I43+(J43*Parametrit!$B$4)+(K43*Parametrit!$B$5)+M43,\"\")","v":""}]
[null,"",{"$f":"IF(D44<>\"\",VLOOKUP(D44,Asiakkaat!$A$2:$E$244,2,FALSE),\"\")","v":""},null,null,{"$f":"IF(D44<>\"\",VLOOKUP(D44,Asiakkaat!$A$2:$E$244,3,FALSE),\"\")","v":""},{"$f":"IF(D44<>\"\",VLOOKUP(D44,Asiakkaat!$A$2:$E$100,4,FALSE),\"\")","v":""},{"$f":"IF(D44<>\"\",VLOOKUP(D44,Asiakkaat!$A$2:$E$394,5,FALSE)*2,\"\")","v":""},{"$f":"IF(D44<>\"\",H44*Parametrit!$B$6,\"\")","v":""},null,null,{"$f":"IF((J44*Parametrit!$B$4)+(K44*Parametrit!$B$5)=0,\"\",(J44*Parametrit!$B$4)+(K44*Parametrit!$B$5))","v":""},null,{"$f":"IF(A44<>\"\",I44+(J44*Parametrit!$B$4)+(K44*Parametrit!$B$5)+M44,\"\")","v":""}]
[null,"",{"$f":"IF(D45<>\"\",VLOOKUP(D45,Asiakkaat!$A$2:$E$244,2,FALSE),\"\")","v":""},null,null,{"$f":"IF(D45<>\"\",VLOOKUP(D45,Asiakkaat!$A$2:$E$244,3,FALSE),\"\")","v":""},{"$f":"IF(D45<>\"\",VLOOKUP(D45,Asiakkaat!$A$2:$E$100,4,FALSE),\"\")","v":""},{"$f":"IF(D45<>\"\",VLOOKUP(D45,Asiakkaat!$A$2:$E$394,5,FALSE)*2,\"\")","v":""},{"$f":"IF(D45<>\"\",H45*Parametrit!$B$6,\"\")","v":""},null,null,{"$f":"IF((J45*Parametrit!$B$4)+(K45*Parametrit!$B$5)=0,\"\",(J45*Parametrit!$B$4)+(K45*Parametrit!$B$5))","v":""},null,{"$f":"IF(A45<>\"\",I45+(J45*Parametrit!$B$4)+(K45*Parametrit!$B$5)+M45,\"\")","v":""}]
[null,"",{"$f":"IF(D46<>\"\",VLOOKUP(D46,Asiakkaat!$A$2:$E$244,2,FALSE),\"\")","v":""},null,null,{"$f":"IF(D46<>\"\",VLOOKUP(D46,Asiakkaat!$A$2:$E$244,3,FALSE),\"\")","v":""},{"$f":"IF(D46<>\"\",VLOOKUP(D46,Asiakkaat!$A$2:$E$100,4,FALSE),\"\")","v":""},{"$f":"IF(D46<>\"\",VLOOKUP(D46,Asiakkaat!$A$2:$E$394,5,FALSE)*2,\"\")","v":""},{"$f":"IF(D46<>\"\",H46*Parametrit!$B$6,\"\")","v":""},null,null,{"$f":"IF((J46*Parametrit!$B$4)+(K46*Parametrit!$B$5)=0,\"\",(J46*Parametrit!$B$4)+(K46*Parametrit!$B$5))","v":""},null,{"$f":"IF(A46<>\"\",I46+(J46*Parametrit!$B$4)+(K46*Parametrit!$B$5)+M46,\"\")","v":""}]
[null,"",{"$f":"IF(D47<>\"\",VLOOKUP(D47,Asiakkaat!$A$2:$E$244,2,FALSE),\"\")","v":""},null,null,{"$f":"IF(D47<>\"\",VLOOKUP(D47,Asiakkaat!$A$2:$E$244,3,FALSE),\"\")","v":""},{"$f":"IF(D47<>\"\",VLOOKUP(D47,Asiakkaat!$A$2:$E$100,4,FALSE),\"\")","v":""},{"$f":"IF(D47<>\"\",VLOOKUP(D47,Asiakkaat!$A$2:$E$394,5,FALSE)*2,\"\")","v":""},{"$f":"IF(D47<>\"\",H47*Parametrit!$B$6,\"\")","v":""},null,null,{"$f":"IF((J47*Parametrit!$B$4)+(K47*Parametrit!$B$5)=0,\"\",(J47*Parametrit!$B$4)+(K47*Parametrit!$B$5))","v":""},null,{"$f":"IF(A47<>\"\",I47+(J47*Parametrit!$B$4)+(K47*Parametrit!$B$5)+M47,\"\")","v":""}]
[null,"",{"$f":"IF(D48<>\"\",VLOOKUP(D48,Asiakkaat!$A$2:$E$244,2,FALSE),\"\")","v":""},null,null,{"$f":"IF(D48<>\"\",VLOOKUP(D48,Asiakkaat!$A$2:$E$244,3,FALSE),\"\")","v":""},{"$f":"IF(D48<>\"\",VLOOKUP(D48,Asiakkaat!$A$2:$E$100,4,FALSE),\"\")","v":""},{"$f":"IF(D48<>\"\",VLOOKUP(D48,Asiakkaat!$A$2:$E$394,5,FALSE)*2,\"\")","v":""},{"$f":"IF(D48<>\"\",H48*Parametrit!$B$6,\"\")","v":""},null,null,{"$f":"IF((J48*Parametrit!$B$4)+(K48*Parametrit!$B$5)=0,\"\",(J48*Parametrit!$B$4)+(K48*Parametrit!$B$5))","v":""},null,{"$f":"IF(A48<>\"\",I48+(J48*Parametrit!$B$4)+(K48*Parametrit!$B$5)+M48,\"\")","v":""}]
[null,"",{"$f":"IF(D49<>\"\",VLOOKUP(D49,Asiakkaat!$A$2:$E$244,2,FALSE),\"\")","v":""},null,null,{"$f":"IF(D49<>\"\",VLOOKUP(D49,Asiakkaat!$A$2:$E$244,3,FALSE),\"\")","v":""},{"$f":"IF(D49<>\"\",VLOOKUP(D49,Asiakkaat!$A$2:$E$100,4,FALSE),\"\")","v":""},{"$f":"IF(D49<>\"\",VLOOKUP(D49,Asiakkaat!$A$2:$E$394,5,FALSE)*2,\"\")","v":""},{"$f":"IF(D49<>\"\",H49*Parametrit!$B$6,\"\")","v":""},null,null,{"$f":"IF((J49*Parametrit!$B$4)+(K49*Parametrit!$B$5)=0,\"\",(J49*Parametrit!$B$4)+(K49*Parametrit!$B$5))","v":""},null,{"$f":"IF(A49<>\"\",I49+(J49*Parametrit!$B$4)+(K49*Parametrit!$B$5)+M49,\"\")","v":""}]
[null,"",{"$f":"IF(D50<>\"\",VLOOKUP(D50,Asiakkaat!$A$2:$E$244,2,FALSE),\"\")","v":""},null,null,{"$f":"IF(D50<>\"\",VLOOKUP(D50,Asiakkaat!$A$2:$E$244,3,FALSE),\"\")","v":""},{"$f":"IF(D50<>\"\",VLOOKUP(D50,Asiakkaat!$A$2:$E$100,4,FALSE),\"\")","v":""},{"$f":"IF(D50<>\"\",VLOOKUP(D50,Asiakkaat!$A$2:$E$394,5,FALSE)*2,\"\")","v":""},{"$f":"IF(D50<>\"\",H50*Parametrit!$B$6,\"\")","v":""},null,null,{"$f":"IF((J50*Parametrit!$B$4)+(K50*Parametrit!$B$5)=0,\"\",(J50*Parametrit!$B$4)+(K50*Parametrit!$B$5))","v":""},null,{"$f":"IF(A50<>\"\",I50+(J50*Parametrit!$B$4)+(K50*Parametrit!$B$5)+M50,\"\")","v":""}]
[null,"",{"$f":"IF(D51<>\"\",VLOOKUP(D51,Asiakkaat!$A$2:$E$244,2,FALSE),\"\")","v":""},null,null,{"$f":"IF(D51<>\"\",VLOOKUP(D51,Asiakkaat!$A$2:$E$244,3,FALSE),\"\")","v":""},{"$f":"IF(D51<>\"\",VLOOKUP(D51,Asiakkaat!$A$2:$E$100,4,FALSE),\"\")","v":""},{"$f":"IF(D51<>\"\",VLOOKUP(D51,Asiakkaat!$A$2:$E$394,5,FALSE)*2,\"\")","v":""},{"$f":"IF(D51<>\"\",H51*Parametrit!$B$6,\"\")","v":""},null,null,{"$f":"IF((J51*Parametrit!$B$4)+(K51*Parametrit!$B$5)=0,\"\",(J51*Parametrit!$B$4)+(K51*Parametrit!$B$5))","v":""},null,{"$f":"IF(A51<>\"\",I51+(J51*Parametrit!$B$4)+(K51*Parametrit!$B$5)+M51,\"\")","v":""}]
[null,"",{"$f":"IF(D52<>\"\",VLOOKUP(D52,Asiakkaat!$A$2:$E$244,2,FALSE),\"\")","v":""},null,null,{"$f":"IF(D52<>\"\",VLOOKUP(D52,Asiakkaat!$A$2:$E$244,3,FALSE),\"\")","v":""},{"$f":"IF(D52<>\"\",VLOOKUP(D52,Asiakkaat!$A$2:$E$100,4,FALSE),\"\")","v":""},{"$f":"IF(D52<>\"\",VLOOKUP(D52,Asiakkaat!$A$2:$E$394,5,FALSE)*2,\"\")","v":""},{"$f":"IF(D52<>\"\",H52*Parametrit!$B$6,\"\")","v":""},null,null,{"$f":"IF((J52*Parametrit!$B$4)+(K52*Parametrit!$B$5)=0,\"\",(J52*Parametrit!$B$4)+(K52*Parametrit!$B$5))","v":""},null,{"$f":"IF(A52<>\"\",I52+(J52*Parametrit!$B$4)+(K52*Parametrit!$B$5)+M52,\"\")","v":""}]
[null,"",{"$f":"IF(D53<>\"\",VLOOKUP(D53,Asiakkaat!$A$2:$E$244,2,FALSE),\"\")","v":""},null,null,{"$f":"IF(D53<>\"\",VLOOKUP(D53,Asiakkaat!$A$2:$E$244,3,FALSE),\"\")","v":""},{"$f":"IF(D53<>\"\",VLOOKUP(D53,Asiakkaat!$A$2:$E$100,4,FALSE),\"\")","v":""},{"$f":"IF(D53<>\"\",VLOOKUP(D53,Asiakkaat!$A$2:$E$394,5,FALSE)*2,\"\")","v":""},{"$f":"IF(D53<>\"\",H53*Parametrit!$B$6,\"\")","v":""},null,null,{"$f":"IF((J53*Parametrit!$B$4)+(K53*Parametrit!$B$5)=0,\"\",(J53*Parametrit!$B$4)+(K53*Parametrit!$B$5))","v":""},null,{"$f":"IF(A53<>\"\",I53+(J53*Parametrit!$B$4)+(K53*Parametrit!$B$5)+M53,\"\")","v":""}]
[null,"",{"$f":"IF(D54<>\"\",VLOOKUP(D54,Asiakkaat!$A$2:$E$244,2,FALSE),\"\")","v":""},null,null,{"$f":"IF(D54<>\"\",VLOOKUP(D54,Asiakkaat!$A$2:$E$244,3,FALSE),\"\")","v":""},{"$f":"IF(D54<>\"\",VLOOKUP(D54,Asiakkaat!$A$2:$E$100,4,FALSE),\"\")","v":""},{"$f":"IF(D54<>\"\",VLOOKUP(D54,Asiakkaat!$A$2:$E$394,5,FALSE)*2,\"\")","v":""},{"$f":"IF(D54<>\"\",H54*Parametrit!$B$6,\"\")","v":""},null,null,{"$f":"IF((J54*Parametrit!$B$4)+(K54*Parametrit!$B$5)=0,\"\",(J54*Parametrit!$B$4)+(K54*Parametrit!$B$5))","v":""},null,{"$f":"IF(A54<>\"\",I54+(J54*Parametrit!$B$4)+(K54*Parametrit!$B$5)+M54,\"\")","v":""}]
[null,"",{"$f":"IF(D55<>\"\",VLOOKUP(D55,Asiakkaat!$A$2:$E$244,2,FALSE),\"\")","v":""},null,null,{"$f":"IF(D55<>\"\",VLOOKUP(D55,Asiakkaat!$A$2:$E$244,3,FALSE),\"\")","v":""},{"$f":"IF(D55<>\"\",VLOOKUP(D55,Asiakkaat!$A$2:$E$100,4,FALSE),\"\")","v":""},{"$f":"IF(D55<>\"\",VLOOKUP(D55,Asiakkaat!$A$2:$E$394,5,FALSE)*2,\"\")","v":""},{"$f":"IF(D55<>\"\",H55*Parametrit!$B$6,\"\")","v":""},null,null,{"$f":"IF((J55*Parametrit!$B$4)+(K55*Parametrit!$B$5)=0,\"\",(J55*Parametrit!$B$4)+(K55*Parametrit!$B$5))","v":""},null,{"$f":"IF(A55<>\"\",I55+(J55*Parametrit!$B$4)+(K55*Parametrit!$B$5)+M55,\"\")","v":""}]
[null,"",{"$f":"IF(D56<>\"\",VLOOKUP(D56,Asiakkaat!$A$2:$E$244,2,FALSE),\"\")","v":""},null,null,{"$f":"IF(D56<>\"\",VLOOKUP(D56,Asiakkaat!$A$2:$E$244,3,FALSE),\"\")","v":""},{"$f":"IF(D56<>\"\",VLOOKUP(D56,Asiakkaat!$A$2:$E$100,4,FALSE),\"\")","v":""},{"$f":"IF(D56<>\"\",VLOOKUP(D56,Asiakkaat!$A$2:$E$394,5,FALSE)*2,\"\")","v":""},{"$f":"IF(D56<>\"\",H56*Parametrit!$B$6,\"\")","v":""},null,null,{"$f":"IF((J56*Parametrit!$B$4)+(K56*Parametrit!$B$5)=0,\"\",(J56*Parametrit!$B$4)+(K56*Parametrit!$B$5))","v":""},null,{"$f":"IF(A56<>\"\",I56+(J56*Parametrit!$B$4)+(K56*Parametrit!$B$5)+M56,\"\")","v":""}]
[null,"",{"$f":"IF(D57<>\"\",VLOOKUP(D57,Asiakkaat!$A$2:$E$244,2,FALSE),\"\")","v":""},null,null,{"$f":"IF(D57<>\"\",VLOOKUP(D57,Asiakkaat!$A$2:$E$244,3,FALSE),\"\")","v":""},{"$f":"IF(D57<>\"\",VLOOKUP(D57,Asiakkaat!$A$2:$E$100,4,FALSE),\"\")","v":""},{"$f":"IF(D57<>\"\",VLOOKUP(D57,Asiakkaat!$A$2:$E$394,5,FALSE)*2,\"\")","v":""},{"$f":"IF(D57<>\"\",H57*Parametrit!$B$6,\"\")","v":""},null,null,{"$f":"IF((J57*Parametrit!$B$4)+(K57*Parametrit!$B$5)=0,\"\",(J57*Parametrit!$B$4)+(K57*Parametrit!$B$5))","v":""},null,{"$f":"IF(A57<>\"\",I57+(J57*Parametrit!$B$4)+(K57*Parametrit!$B$5)+M57,\"\")","v":""}]
[null,"",{"$f":"IF(D58<>\"\",VLOOKUP(D58,Asiakkaat!$A$2:$E$244,2,FALSE),\"\")","v":""},null,null,{"$f":"IF(D58<>\"\",VLOOKUP(D58,Asiakkaat!$A$2:$E$244,3,FALSE),\"\")","v":""},{"$f":"IF(D58<>\"\",VLOOKUP(D58,Asiakkaat!$A$2:$E$100,4,FALSE),\"\")","v":""},{"$f":"IF(D58<>\"\",VLOOKUP(D58,Asiakkaat!$A$2:$E$394,5,FALSE)*2,\"\")","v":""},{"$f":"IF(D58<>\"\",H58*Parametrit!$B$6,\"\")","v":""},null,null,{"$f":"IF((J58*Parametrit!$B$4)+(K58*Parametrit!$B$5)=0,\"\",(J58*Parametrit!$B$4)+(K58*Parametrit!$B$5))","v":""},null,{"$f":"IF(A58<>\"\",I58+(J58*Parametrit!$B$4)+(K58*Parametrit!$B$5)+M58,\"\")","v":""}]
[null,"",{"$f":"IF(D59<>\"\",VLOOKUP(D59,Asiakkaat!$A$2:$E$244,2,FALSE),\"\")","v":""},null,null,{"$f":"IF(D59<>\"\",VLOOKUP(D59,Asiakkaat!$A$2:$E$244,3,FALSE),\"\")","v":""},{"$f":"IF(D59<>\"\",VLOOKUP(D59,Asiakkaat!$A$2:$E$100,4,FALSE),\"\")","v":""},{"$f":"IF(D59<>\"\",VLOOKUP(D59,Asiakkaat!$A$2:$E$394,5,FALSE)*2,\"\")","v":""},{"$f":"IF(D59<>\"\",H59*Parametrit!$B$6,\"\")","v":""},null,null,{"$f":"IF((J59*Parametrit!$B$4)+(K59*Parametrit!$B$5)=0,\"\",(J59*Parametrit!$B$4)+(K59*Parametrit!$B$5))","v":""},null,{"$f":"IF(A59<>\"\",I59+(J59*Parametrit!$B$4)+(K59*Parametrit!$B$5)+M59,\"\")","v":""}]
[null,"",{"$f":"IF(D60<>\"\",VLOOKUP(D60,Asiakkaat!$A$2:$E$244,2,FALSE),\"\")","v":""},null,null,{"$f":"IF(D60<>\"\",VLOOKUP(D60,Asiakkaat!$A$2:$E$244,3,FALSE),\"\")","v":""},{"$f":"IF(D60<>\"\",VLOOKUP(D60,Asiakkaat!$A$2:$E$100,4,FALSE),\"\")","v":""},{"$f":"IF(D60<>\"\",VLOOKUP(D60,Asiakkaat!$A$2:$E$394,5,FALSE)*2,\"\")","v":""},{"$f":"IF(D60<>\"\",H60*Parametrit!$B$6,\"\")","v":""},null,null,{"$f":"IF((J60*Parametrit!$B$4)+(K60*Parametrit!$B$5)=0,\"\",(J60*Parametrit!$B$4)+(K60*Parametrit!$B$5))","v":""},null,{"$f":"IF(A60<>\"\",I60+(J60*Parametrit!$B$4)+(K60*Parametrit!$B$5)+M60,\"\")","v":""}]
[null,"",{"$f":"IF(D61<>\"\",VLOOKUP(D61,Asiakkaat!$A$2:$E$244,2,FALSE),\"\")","v":""},null,null,{"$f":"IF(D61<>\"\",VLOOKUP(D61,Asiakkaat!$A$2:$E$244,3,FALSE),\"\")","v":""},{"$f":"IF(D61<>\"\",VLOOKUP(D61,Asiakkaat!$A$2:$E$100,4,FALSE),\"\")","v":""},{"$f":"IF(D61<>\"\",VLOOKUP(D61,Asiakkaat!$A$2:$E$394,5,FALSE)*2,\"\")","v":""},{"$f":"IF(D61<>\"\",H61*Parametrit!$B$6,\"\")","v":""},null,null,{"$f":"IF((J61*Parametrit!$B$4)+(K61*Parametrit!$B$5)=0,\"\",(J61*Parametrit!$B$4)+(K61*Parametrit!$B$5))","v":""},null,{"$f":"IF(A61<>\"\",I61+(J61*Parametrit!$B$4)+(K61*Parametrit!$B$5)+M61,\"\")","v":""}]
[null,"",{"$f":"IF(D62<>\"\",VLOOKUP(D62,Asiakkaat!$A$2:$E$244,2,FALSE),\"\")","v":""},null,null,{"$f":"IF(D62<>\"\",VLOOKUP(D62,Asiakkaat!$A$2:$E$244,3,FALSE),\"\")","v":""},{"$f":"IF(D62<>\"\",VLOOKUP(D62,Asiakkaat!$A$2:$E$100,4,FALSE),\"\")","v":""},{"$f":"IF(D62<>\"\",VLOOKUP(D62,Asiakkaat!$A$2:$E$394,5,FALSE)*2,\"\")","v":""},{"$f":"IF(D62<>\"\",H62*Parametrit!$B$6,\"\")","v":""},null,null,{"$f":"IF((J62*Parametrit!$B$4)+(K62*Parametrit!$B$5)=0,\"\",(J62*Parametrit!$B$4)+(K62*Parametrit!$B$5))","v":""},null,{"$f":"IF(A62<>\"\",I62+(J62*Parametrit!$B$4)+(K62*Parametrit!$B$5)+M62,\"\")","v":""}]
[null,"",{"$f":"IF(D63<>\"\",VLOOKUP(D63,Asiakkaat!$A$2:$E$244,2,FALSE),\"\")","v":""},null,null,{"$f":"IF(D63<>\"\",VLOOKUP(D63,Asiakkaat!$A$2:$E$244,3,FALSE),\"\")","v":""},{"$f":"IF(D63<>\"\",VLOOKUP(D63,Asiakkaat!$A$2:$E$100,4,FALSE),\"\")","v":""},{"$f":"IF(D63<>\"\",VLOOKUP(D63,Asiakkaat!$A$2:$E$394,5,FALSE)*2,\"\")","v":""},{"$f":"IF(D63<>\"\",H63*Parametrit!$B$6,\"\")","v":""},null,null,{"$f":"IF((J63*Parametrit!$B$4)+(K63*Parametrit!$B$5)=0,\"\",(J63*Parametrit!$B$4)+(K63*Parametrit!$B$5))","v":""},null,{"$f":"IF(A63<>\"\",I63+(J63*Parametrit!$B$4)+(K63*Parametrit!$B$5)+M63,\"\")","v":""}]
[null,"",{"$f":"IF(D64<>\"\",VLOOKUP(D64,Asiakkaat!$A$2:$E$244,2,FALSE),\"\")","v":""},null,null,{"$f":"IF(D64<>\"\",VLOOKUP(D64,Asiakkaat!$A$2:$E$244,3,FALSE),\"\")","v":""},{"$f":"IF(D64<>\"\",VLOOKUP(D64,Asiakkaat!$A$2:$E$100,4,FALSE),\"\")","v":""},{"$f":"IF(D64<>\"\",VLOOKUP(D64,Asiakkaat!$A$2:$E$394,5,FALSE)*2,\"\")","v":""},{"$f":"IF(D64<>\"\",H64*Parametrit!$B$6,\"\")","v":""},null,null,{"$f":"IF((J64*Parametrit!$B$4)+(K64*Parametrit!$B$5)=0,\"\",(J64*Parametrit!$B$4)+(K64*Parametrit!$B$5))","v":""},null,{"$f":"IF(A64<>\"\",I64+(J64*Parametrit!$B$4)+(K64*Parametrit!$B$5)+M64,\"\")","v":""}]
[null,"",{"$f":"IF(D65<>\"\",VLOOKUP(D65,Asiakkaat!$A$2:$E$244,2,FALSE),\"\")","v":""},null,null,{"$f":"IF(D65<>\"\",VLOOKUP(D65,Asiakkaat!$A$2:$E$244,3,FALSE),\"\")","v":""},{"$f":"IF(D65<>\"\",VLOOKUP(D65,Asiakkaat!$A$2:$E$100,4,FALSE),\"\")","v":""},{"$f":"IF(D65<>\"\",VLOOKUP(D65,Asiakkaat!$A$2:$E$394,5,FALSE)*2,\"\")","v":""},{"$f":"IF(D65<>\"\",H65*Parametrit!$B$6,\"\")","v":""},null,null,{"$f":"IF((J65*Parametrit!$B$4)+(K65*Parametrit!$B$5)=0,\"\",(J65*Parametrit!$B$4)+(K65*Parametrit!$B$5))","v":""},null,{"$f":"IF(A65<>\"\",I65+(J65*Parametrit!$B$4)+(K65*Parametrit!$B$5)+M65,\"\")","v":""}]
[null,"",{"$f":"IF(D66<>\"\",VLOOKUP(D66,Asiakkaat!$A$2:$E$244,2,FALSE),\"\")","v":""},null,null,{"$f":"IF(D66<>\"\",VLOOKUP(D66,Asiakkaat!$A$2:$E$244,3,FALSE),\"\")","v":""},{"$f":"IF(D66<>\"\",VLOOKUP(D66,Asiakkaat!$A$2:$E$100,4,FALSE),\"\")","v":""},{"$f":"IF(D66<>\"\",VLOOKUP(D66,Asiakkaat!$A$2:$E$394,5,FALSE)*2,\"\")","v":""},{"$f":"IF(D66<>\"\",H66*Parametrit!$B$6,\"\")","v":""},null,null,{"$f":"IF((J66*Parametrit!$B$4)+(K66*Parametrit!$B$5)=0,\"\",(J66*Parametrit!$B$4)+(K66*Parametrit!$B$5))","v":""},null,{"$f":"IF(A66<>\"\",I66+(J66*Parametrit!$B$4)+(K66*Parametrit!$B$5)+M66,\"\")","v":""}]
[null,{"$f":"IF(A67<>\"\",IFERROR(WEEKDAY(A67),\"\"),\"\")","v":""},{"$f":"IF(D67<>\"\",VLOOKUP(D67,Asiakkaat!$A$2:$E$244,2,FALSE),\"\")","v":""},null,null,{"$f":"IF(D67<>\"\",VLOOKUP(D67,Asiakkaat!$A$2:$E$244,3,FALSE),\"\")","v":""},{"$f":"IF(D67<>\"\",VLOOKUP(D67,Asiakkaat!$A$2:$E$100,4,FALSE),\"\")","v":""},{"$f":"IF(D67<>\"\",VLOOKUP(D67,Asiakkaat!$A$2:$E$394,5,FALSE)*2,\"\")","v":""},{"$f":"IF(D67<>\"\",H67*Parametrit!$B$6,\"\")","v":""},null,null,{"$f":"IF((J67*Parametrit!$B$4)+(K67*Parametrit!$B$5)=0,\"\",(J67*Parametrit!$B$4)+(K67*Parametrit!$B$5))","v":""},null,{"$f":"IF(A67<>\"\",I67+(J67*Parametrit!$B$4)+(K67*Parametrit!$B$5)+M67,\"\")","v":""}]
[null,"",{"$f":"IF(D68<>\"\",VLOOKUP(D68,Asiakkaat!$A$2:$E$244,2,FALSE),\"\")","v":""},null,null,{"$f":"IF(D68<>\"\",VLOOKUP(D68,Asiakkaat!$A$2:$E$244,3,FALSE),\"\")","v":""},{"$f":"IF(D68<>\"\",VLOOKUP(D68,Asiakkaat!$A$2:$E$100,4,FALSE),\"\")","v":""},{"$f":"IF(D68<>\"\",VLOOKUP(D68,Asiakkaat!$A$2:$E$394,5,FALSE)*2,\"\")","v":""},{"$f":"IF(D68<>\"\",H68*Parametrit!$B$6,\"\")","v":""},null,null,{"$f":"IF((J68*Parametrit!$B$4)+(K68*Parametrit!$B$5)=0,\"\",(J68*Parametrit!$B$4)+(K68*Parametrit!$B$5))","v":""},null,{"$f":"IF(A68<>\"\",I68+(J68*Parametrit!$B$4)+(K68*Parametrit!$B$5)+M68,\"\")","v":""}]
[null,"",{"$f":"IF(D69<>\"\",VLOOKUP(D69,Asiakkaat!$A$2:$E$244,2,FALSE),\"\")","v":""},null,null,{"$f":"IF(D69<>\"\",VLOOKUP(D69,Asiakkaat!$A$2:$E$244,3,FALSE),\"\")","v":""},{"$f":"IF(D69<>\"\",VLOOKUP(D69,Asiakkaat!$A$2:$E$100,4,FALSE),\"\")","v":""},{"$f":"IF(D69<>\"\",VLOOKUP(D69,Asiakkaat!$A$2:$E$394,5,FALSE)*2,\"\")","v":""},{"$f":"IF(D69<>\"\",H69*Parametrit!$B$6,\"\")","v":""},null,null,{"$f":"IF((J69*Parametrit!$B$4)+(K69*Parametrit!$B$5)=0,\"\",(J69*Parametrit!$B$4)+(K69*Parametrit!$B$5))","v":""},null,{"$f":"IF(A69<>\"\",I69+(J69*Parametrit!$B$4)+(K69*Parametrit!$B$5)+M69,\"\")","v":""}]
[null,"",{"$f":"IF(D70<>\"\",VLOOKUP(D70,Asiakkaat!$A$2:$E$244,2,FALSE),\"\")","v":""},null,null,{"$f":"IF(D70<>\"\",VLOOKUP(D70,Asiakkaat!$A$2:$E$244,3,FALSE),\"\")","v":""},{"$f":"IF(D70<>\"\",VLOOKUP(D70,Asiakkaat!$A$2:$E$100,4,FALSE),\"\")","v":""},{"$f":"IF(D70<>\"\",VLOOKUP(D70,Asiakkaat!$A$2:$E$394,5,FALSE)*2,\"\")","v":""},{"$f":"IF(D70<>\"\",H70*Parametrit!$B$6,\"\")","v":""},null,null,{"$f":"IF((J70*Parametrit!$B$4)+(K70*Parametrit!$B$5)=0,\"\",(J70*Parametrit!$B$4)+(K70*Parametrit!$B$5))","v":""},null,{"$f":"IF(A70<>\"\",I70+(J70*Parametrit!$B$4)+(K70*Parametrit!$B$5)+M70,\"\")","v":""}]
[null,"",{"$f":"IF(D71<>\"\",VLOOKUP(D71,Asiakkaat!$A$2:$E$244,2,FALSE),\"\")","v":""},null,null,{"$f":"IF(D71<>\"\",VLOOKUP(D71,Asiakkaat!$A$2:$E$244,3,FALSE),\"\")","v":""},{"$f":"IF(D71<>\"\",VLOOKUP(D71,Asiakkaat!$A$2:$E$100,4,FALSE),\"\")","v":""},{"$f":"IF(D71<>\"\",VLOOKUP(D71,Asiakkaat!$A$2:$E$394,5,FALSE)*2,\"\")","v":""},{"$f":"IF(D71<>\"\",H71*Parametrit!$B$6,\"\")","v":""},null,null,{"$f":"IF((J71*Parametrit!$B$4)+(K71*Parametrit!$B$5)=0,\"\",(J71*Parametrit!$B$4)+(K71*Parametrit!$B$5))","v":""},null,{"$f":"IF(A71<>\"\",I71+(J71*Parametrit!$B$4)+(K71*Parametrit!$B$5)+M71,\"\")","v":""}]
[null,"",{"$f":"IF(D72<>\"\",VLOOKUP(D72,Asiakkaat!$A$2:$E$244,2,FALSE),\"\")","v":""},null,null,{"$f":"IF(D72<>\"\",VLOOKUP(D72,Asiakkaat!$A$2:$E$244,3,FALSE),\"\")","v":""},{"$f":"IF(D72<>\"\",VLOOKUP(D72,Asiakkaat!$A$2:$E$100,4,FALSE),\"\")","v":""},{"$f":"IF(D72<>\"\",VLOOKUP(D72,Asiakkaat!$A$2:$E$394,5,FALSE)*2,\"\")","v":""},{"$f":"IF(D72<>\"\",H72*Parametrit!$B$6,\"\")","v":""},null,null,{"$f":"IF((J72*Parametrit!$B$4)+(K72*Parametrit!$B$5)=0,\"\",(J72*Parametrit!$B$4)+(K72*Parametrit!$B$5))","v":""},null,{"$f":"IF(A72<>\"\",I72+(J72*Parametrit!$B$4)+(K72*Parametrit!$B$5)+M72,\"\")","v":""}]
[null,"",{"$f":"IF(D73<>\"\",VLOOKUP(D73,Asiakkaat!$A$2:$E$244,2,FALSE),\"\")","v":""},null,null,{"$f":"IF(D73<>\"\",VLOOKUP(D73,Asiakkaat!$A$2:$E$244,3,FALSE),\"\")","v":""},{"$f":"IF(D73<>\"\",VLOOKUP(D73,Asiakkaat!$A$2:$E$100,4,FALSE),\"\")","v":""},{"$f":"IF(D73<>\"\",VLOOKUP(D73,Asiakkaat!$A$2:$E$394,5,FALSE)*2,\"\")","v":""},{"$f":"IF(D73<>\"\",H73*Parametrit!$B$6,\"\")","v":""},null,null,{"$f":"IF((J73*Parametrit!$B$4)+(K73*Parametrit!$B$5)=0,\"\",(J73*Parametrit!$B$4)+(K73*Parametrit!$B$5))","v":""},null,{"$f":"IF(A73<>\"\",I73+(J73*Parametrit!$B$4)+(K73*Parametrit!$B$5)+M73,\"\")","v":""}]
[null,"",{"$f":"IF(D74<>\"\",VLOOKUP(D74,Asiakkaat!$A$2:$E$244,2,FALSE),\"\")","v":""},null,null,{"$f":"IF(D74<>\"\",VLOOKUP(D74,Asiakkaat!$A$2:$E$244,3,FALSE),\"\")","v":""},{"$f":"IF(D74<>\"\",VLOOKUP(D74,Asiakkaat!$A$2:$E$100,4,FALSE),\"\")","v":""},{"$f":"IF(D74<>\"\",VLOOKUP(D74,Asiakkaat!$A$2:$E$394,5,FALSE)*2,\"\")","v":""},{"$f":"IF(D74<>\"\",H74*Parametrit!$B$6,\"\")","v":""},null,null,{"$f":"IF((J74*Parametrit!$B$4)+(K74*Parametrit!$B$5)=0,\"\",(J74*Parametrit!$B$4)+(K74*Parametrit!$B$5))","v":""},null,{"$f":"IF(A74<>\"\",I74+(J74*Parametrit!$B$4)+(K74*Parametrit!$B$5)+M74,\"\")","v":""}]
[null,"",{"$f":"IF(D75<>\"\",VLOOKUP(D75,Asiakkaat!$A$2:$E$244,2,FALSE),\"\")","v":""},null,null,{"$f":"IF(D75<>\"\",VLOOKUP(D75,Asiakkaat!$A$2:$E$244,3,FALSE),\"\")","v":""},{"$f":"IF(D75<>\"\",VLOOKUP(D75,Asiakkaat!$A$2:$E$100,4,FALSE),\"\")","v":""},{"$f":"IF(D75<>\"\",VLOOKUP(D75,Asiakkaat!$A$2:$E$394,5,FALSE)*2,\"\")","v":""},{"$f":"IF(D75<>\"\",H75*Parametrit!$B$6,\"\")","v":""},null,null,{"$f":"IF((J75*Parametrit!$B$4)+(K75*Parametrit!$B$5)=0,\"\",(J75*Parametrit!$B$4)+(K75*Parametrit!$B$5))","v":""},null,{"$f":"IF(A75<>\"\",I75+(J75*Parametrit!$B$4)+(K75*Parametrit!$B$5)+M75,\"\")","v":""}]
[null,"",{"$f":"IF(D76<>\"\",VLOOKUP(D76,Asiakkaat!$A$2:$E$244,2,FALSE),\"\")","v":""},null,null,{"$f":"IF(D76<>\"\",VLOOKUP(D76,Asiakkaat!$A$2:$E$244,3,FALSE),\"\")","v":""},{"$f":"IF(D76<>\"\",VLOOKUP(D76,Asiakkaat!$A$2:$E$100,4,FALSE),\"\")","v":""},{"$f":"IF(D76<>\"\",VLOOKUP(D76,Asiakkaat!$A$2:$E$394,5,FALSE)*2,\"\")","v":""},{"$f":"IF(D76<>\"\",H76*Parametrit!$B$6,\"\")","v":""},null,null,{"$f":"IF((J76*Parametrit!$B$4)+(K76*Parametrit!$B$5)=0,\"\",(J76*Parametrit!$B$4)+(K76*Parametrit!$B$5))","v":""},null,{"$f":"IF(A76<>\"\",I76+(J76*Parametrit!$B$4)+(K76*Parametrit!$B$5)+M76,\"\")","v":""}]
[null,"",{"$f":"IF(D77<>\"\",VLOOKUP(D77,Asiakkaat!$A$2:$E$244,2,FALSE),\"\")","v":""},null,null,{"$f":"IF(D77<>\"\",VLOOKUP(D77,Asiakkaat!$A$2:$E$244,3,FALSE),\"\")","v":""},{"$f":"IF(D77<>\"\",VLOOKUP(D77,Asiakkaat!$A$2:$E$100,4,FALSE),\"\")","v":""},{"$f":"IF(D77<>\"\",VLOOKUP(D77,Asiakkaat!$A$2:$E$394,5,FALSE)*2,\"\")","v":""},{"$f":"IF(D77<>\"\",H77*Parametrit!$B$6,\"\")","v":""},null,null,{"$f":"IF((J77*Parametrit!$B$4)+(K77*Parametrit!$B$5)=0,\"\",(J77*Parametrit!$B$4)+(K77*Parametrit!$B$5))","v":""},null,{"$f":"IF(A77<>\"\",I77+(J77*Parametrit!$B$4)+(K77*Parametrit!$B$5)+M77,\"\")","v":""}]
[null,"",{"$f":"IF(D78<>\"\",VLOOKUP(D78,Asiakkaat!$A$2:$E$244,2,FALSE),\"\")","v":""},null,null,{"$f":"IF(D78<>\"\",VLOOKUP(D78,Asiakkaat!$A$2:$E$244,3,FALSE),\"\")","v":""},{"$f":"IF(D78<>\"\",VLOOKUP(D78,Asiakkaat!$A$2:$E$100,4,FALSE),\"\")","v":""},{"$f":"IF(D78<>\"\",VLOOKUP(D78,Asiakkaat!$A$2:$E$394,5,FALSE)*2,\"\")","v":""},{"$f":"IF(D78<>\"\",H78*Parametrit!$B$6,\"\")","v":""},null,null,{"$f":"IF((J78*Parametrit!$B$4)+(K78*Parametrit!$B$5)=0,\"\",(J78*Parametrit!$B$4)+(K78*Parametrit!$B$5))","v":""},null,{"$f":"IF(A78<>\"\",I78+(J78*Parametrit!$B$4)+(K78*Parametrit!$B$5)+M78,\"\")","v":""}]
[null,"",{"$f":"IF(D79<>\"\",VLOOKUP(D79,Asiakkaat!$A$2:$E$244,2,FALSE),\"\")","v":""},null,null,{"$f":"IF(D79<>\"\",VLOOKUP(D79,Asiakkaat!$A$2:$E$244,3,FALSE),\"\")","v":""},{"$f":"IF(D79<>\"\",VLOOKUP(D79,Asiakkaat!$A$2:$E$100,4,FALSE),\"\")","v":""},{"$f":"IF(D79<>\"\",VLOOKUP(D79,Asiakkaat!$A$2:$E$394,5,FALSE)*2,\"\")","v":""},{"$f":"IF(D79<>\"\",H79*Parametrit!$B$6,\"\")","v":""},null,null,{"$f":"IF((J79*Parametrit!$B$4)+(K79*Parametrit!$B$5)=0,\"\",(J79*Parametrit!$B$4)+(K79*Parametrit!$B$5))","v":""},null,{"$f":"IF(A79<>\"\",I79+(J79*Parametrit!$B$4)+(K79*Parametrit!$B$5)+M79,\"\")","v":""}]
[null,"",{"$f":"IF(D80<>\"\",VLOOKUP(D80,Asiakkaat!$A$2:$E$244,2,FALSE),\"\")","v":""},null,null,{"$f":"IF(D80<>\"\",VLOOKUP(D80,Asiakkaat!$A$2:$E$244,3,FALSE),\"\")","v":""},{"$f":"IF(D80<>\"\",VLOOKUP(D80,Asiakkaat!$A$2:$E$100,4,FALSE),\"\")","v":""},{"$f":"IF(D80<>\"\",VLOOKUP(D80,Asiakkaat!$A$2:$E$394,5,FALSE)*2,\"\")","v":""},{"$f":"IF(D80<>\"\",H80*Parametrit!$B$6,\"\")","v":""},null,null,{"$f":"IF((J80*Parametrit!$B$4)+(K80*Parametrit!$B$5)=0,\"\",(J80*Parametrit!$B$4)+(K80*Parametrit!$B$5))","v":""},null,{"$f":"IF(A80<>\"\",I80+(J80*Parametrit!$B$4)+(K80*Parametrit!$B$5)+M80,\"\")","v":""}]
[null,"",{"$f":"IF(D81<>\"\",VLOOKUP(D81,Asiakkaat!$A$2:$E$244,2,FALSE),\"\")","v":""},null,null,{"$f":"IF(D81<>\"\",VLOOKUP(D81,Asiakkaat!$A$2:$E$244,3,FALSE),\"\")","v":""},{"$f":"IF(D81<>\"\",VLOOKUP(D81,Asiakkaat!$A$2:$E$100,4,FALSE),\"\")","v":""},{"$f":"IF(D81<>\"\",VLOOKUP(D81,Asiakkaat!$A$2:$E$394,5,FALSE)*2,\"\")","v":""},{"$f":"IF(D81<>\"\",H81*Parametrit!$B$6,\"\")","v":""},null,null,{"$f":"IF((J81*Parametrit!$B$4)+(K81*Parametrit!$B$5)=0,\"\",(J81*Parametrit!$B$4)+(K81*Parametrit!$B$5))","v":""},null,{"$f":"IF(A81<>\"\",I81+(J81*Parametrit!$B$4)+(K81*Parametrit!$B$5)+M81,\"\")","v":""}]
[null,"",{"$f":"IF(D82<>\"\",VLOOKUP(D82,Asiakkaat!$A$2:$E$244,2,FALSE),\"\")","v":""},null,null,{"$f":"IF(D82<>\"\",VLOOKUP(D82,Asiakkaat!$A$2:$E$244,3,FALSE),\"\")","v":""},{"$f":"IF(D82<>\"\",VLOOKUP(D82,Asiakkaat!$A$2:$E$100,4,FALSE),\"\")","v":""},{"$f":"IF(D82<>\"\",VLOOKUP(D82,Asiakkaat!$A$2:$E$394,5,FALSE)*2,\"\")","v":""},{"$f":"IF(D82<>\"\",H82*Parametrit!$B$6,\"\")","v":""},null,null,{"$f":"IF((J82*Parametrit!$B$4)+(K82*Parametrit!$B$5)=0,\"\",(J82*Parametrit!$B$4)+(K82*Parametrit!$B$5))","v":""},null,{"$f":"IF(A82<>\"\",I82+(J82*Parametrit!$B$4)+(K82*Parametrit!$B$5)+M82,\"\")","v":""}]
[null,"",{"$f":"IF(D83<>\"\",VLOOKUP(D83,Asiakkaat!$A$2:$E$244,2,FALSE),\"\")","v":""},null,null,{"$f":"IF(D83<>\"\",VLOOKUP(D83,Asiakkaat!$A$2:$E$244,3,FALSE),\"\")","v":""},{"$f":"IF(D83<>\"\",VLOOKUP(D83,Asiakkaat!$A$2:$E$100,4,FALSE),\"\")","v":""},{"$f":"IF(D83<>\"\",VLOOKUP(D83,Asiakkaat!$A$2:$E$394,5,FALSE)*2,\"\")","v":""},{"$f":"IF(D83<>\"\",H83*Parametrit!$B$6,\"\")","v":""},null,null,{"$f":"IF((J83*Parametrit!$B$4)+(K83*Parametrit!$B$5)=0,\"\",(J83*Parametrit!$B$4)+(K83*Parametrit!$B$5))","v":""},null,{"$f":"IF(A83<>\"\",I83+(J83*Parametrit!$B$4)+(K83*Parametrit!$B$5)+M83,\"\")","v":""}]
[null,"",{"$f":"IF(D84<>\"\",VLOOKUP(D84,Asiakkaat!$A$2:$E$244,2,FALSE),\"\")","v":""},null,null,{"$f":"IF(D84<>\"\",VLOOKUP(D84,Asiakkaat!$A$2:$E$244,3,FALSE),\"\")","v":""},{"$f":"IF(D84<>\"\",VLOOKUP(D84,Asiakkaat!$A$2:$E$100,4,FALSE),\"\")","v":""},{"$f":"IF(D84<>\"\",VLOOKUP(D84,Asiakkaat!$A$2:$E$394,5,FALSE)*2,\"\")","v":""},{"$f":"IF(D84<>\"\",H84*Parametrit!$B$6,\"\")","v":""},null,null,{"$f":"IF((J84*Parametrit!$B$4)+(K84*Parametrit!$B$5)=0,\"\",(J84*Parametrit!$B$4)+(K84*Parametrit!$B$5))","v":""},null,{"$f":"IF(A84<>\"\",I84+(J84*Parametrit!$B$4)+(K84*Parametrit!$B$5)+M84,\"\")","v":""}]
[null,"",{"$f":"IF(D85<>\"\",VLOOKUP(D85,Asiakkaat!$A$2:$E$244,2,FALSE),\"\")","v":""},null,null,{"$f":"IF(D85<>\"\",VLOOKUP(D85,Asiakkaat!$A$2:$E$244,3,FALSE),\"\")","v":""},{"$f":"IF(D85<>\"\",VLOOKUP(D85,Asiakkaat!$A$2:$E$100,4,FALSE),\"\")","v":""},{"$f":"IF(D85<>\"\",VLOOKUP(D85,Asiakkaat!$A$2:$E$394,5,FALSE)*2,\"\")","v":""},{"$f":"IF(D85<>\"\",H85*Parametrit!$B$6,\"\")","v":""},null,null,{"$f":"IF((J85*Parametrit!$B$4)+(K85*Parametrit!$B$5)=0,\"\",(J85*Parametrit!$B$4)+(K85*Parametrit!$B$5))","v":""},null,{"$f":"IF(A85<>\"\",I85+(J85*Parametrit!$B$4)+(K85*Parametrit!$B$5)+M85,\"\")","v":""}]
[null,"",{"$f":"IF(D86<>\"\",VLOOKUP(D86,Asiakkaat!$A$2:$E$244,2,FALSE),\"\")","v":""},null,null,{"$f":"IF(D86<>\"\",VLOOKUP(D86,Asiakkaat!$A$2:$E$244,3,FALSE),\"\")","v":""},{"$f":"IF(D86<>\"\",VLOOKUP(D86,Asiakkaat!$A$2:$E$100,4,FALSE),\"\")","v":""},{"$f":"IF(D86<>\"\",VLOOKUP(D86,Asiakkaat!$A$2:$E$394,5,FALSE)*2,\"\")","v":""},{"$f":"IF(D86<>\"\",H86*Parametrit!$B$6,\"\")","v":""},null,null,{"$f":"IF((J86*Parametrit!$B$4)+(K86*Parametrit!$B$5)=0,\"\",(J86*Parametrit!$B$4)+(K86*Parametrit!$B$5))","v":""},null,{"$f":"IF(A86<>\"\",I86+(J86*Parametrit!$B$4)+(K86*Parametrit!$B$5)+M86,\"\")","v":""}]
[null,"",{"$f":"IF(D87<>\"\",VLOOKUP(D87,Asiakkaat!$A$2:$E$244,2,FALSE),\"\")","v":""},null,null,{"$f":"IF(D87<>\"\",VLOOKUP(D87,Asiakkaat!$A$2:$E$244,3,FALSE),\"\")","v":""},{"$f":"IF(D87<>\"\",VLOOKUP(D87,Asiakkaat!$A$2:$E$100,4,FALSE),\"\")","v":""},{"$f":"IF(D87<>\"\",VLOOKUP(D87,Asiakkaat!$A$2:$E$394,5,FALSE)*2,\"\")","v":""},{"$f":"IF(D87<>\"\",H87*Parametrit!$B$6,\"\")","v":""},null,null,{"$f":"IF((J87*Parametrit!$B$4)+(K87*Parametrit!$B$5)=0,\"\",(J87*Parametrit!$B$4)+(K87*Parametrit!$B$5))","v":""},null,{"$f":"IF(A87<>\"\",I87+(J87*Parametrit!$B$4)+(K87*Parametrit!$B$5)+M87,\"\")","v":""}]
[null,"",{"$f":"IF(D88<>\"\",VLOOKUP(D88,Asiakkaat!$A$2:$E$244,2,FALSE),\"\")","v":""},null,null,{"$f":"IF(D88<>\"\",VLOOKUP(D88,Asiakkaat!$A$2:$E$244,3,FALSE),\"\")","v":""},{"$f":"IF(D88<>\"\",VLOOKUP(D88,Asiakkaat!$A$2:$E$100,4,FALSE),\"\")","v":""},{"$f":"IF(D88<>\"\",VLOOKUP(D88,Asiakkaat!$A$2:$E$394,5,FALSE)*2,\"\")","v":""},{"$f":"IF(D88<>\"\",H88*Parametrit!$B$6,\"\")","v":""},null,null,{"$f":"IF((J88*Parametrit!$B$4)+(K88*Parametrit!$B$5)=0,\"\",(J88*Parametrit!$B$4)+(K88*Parametrit!$B$5))","v":""},null,{"$f":"IF(A88<>\"\",I88+(J88*Parametrit!$B$4)+(K88*Parametrit!$B$5)+M88,\"\")","v":""}]
[null,"",{"$f":"IF(D89<>\"\",VLOOKUP(D89,Asiakkaat!$A$2:$E$244,2,FALSE),\"\")","v":""},null,null,{"$f":"IF(D89<>\"\",VLOOKUP(D89,Asiakkaat!$A$2:$E$244,3,FALSE),\"\")","v":""},{"$f":"IF(D89<>\"\",VLOOKUP(D89,Asiakkaat!$A$2:$E$100,4,FALSE),\"\")","v":""},{"$f":"IF(D89<>\"\",VLOOKUP(D89,Asiakkaat!$A$2:$E$394,5,FALSE)*2,\"\")","v":""},{"$f":"IF(D89<>\"\",H89*Parametrit!$B$6,\"\")","v":""},null,null,{"$f":"IF((J89*Parametrit!$B$4)+(K89*Parametrit!$B$5)=0,\"\",(J89*Parametrit!$B$4)+(K89*Parametrit!$B$5))","v":""},null,{"$f":"IF(A89<>\"\",I89+(J89*Parametrit!$B$4)+(K89*Parametrit!$B$5)+M89,\"\")","v":""}]
[null,"",{"$f":"IF(D90<>\"\",VLOOKUP(D90,Asiakkaat!$A$2:$E$244,2,FALSE),\"\")","v":""},null,null,{"$f":"IF(D90<>\"\",VLOOKUP(D90,Asiakkaat!$A$2:$E$244,3,FALSE),\"\")","v":""},{"$f":"IF(D90<>\"\",VLOOKUP(D90,Asiakkaat!$A$2:$E$100,4,FALSE),\"\")","v":""},{"$f":"IF(D90<>\"\",VLOOKUP(D90,Asiakkaat!$A$2:$E$394,5,FALSE)*2,\"\")","v":""},{"$f":"IF(D90<>\"\",H90*Parametrit!$B$6,\"\")","v":""},null,null,{"$f":"IF((J90*Parametrit!$B$4)+(K90*Parametrit!$B$5)=0,\"\",(J90*Parametrit!$B$4)+(K90*Parametrit!$B$5))","v":""},null,{"$f":"IF(A90<>\"\",I90+(J90*Parametrit!$B$4)+(K90*Parametrit!$B$5)+M90,\"\")","v":""}]
[null,"",{"$f":"IF(D91<>\"\",VLOOKUP(D91,Asiakkaat!$A$2:$E$244,2,FALSE),\"\")","v":""},null,null,{"$f":"IF(D91<>\"\",VLOOKUP(D91,Asiakkaat!$A$2:$E$244,3,FALSE),\"\")","v":""},{"$f":"IF(D91<>\"\",VLOOKUP(D91,Asiakkaat!$A$2:$E$100,4,FALSE),\"\")","v":""},{"$f":"IF(D91<>\"\",VLOOKUP(D91,Asiakkaat!$A$2:$E$394,5,FALSE)*2,\"\")","v":""},{"$f":"IF(D91<>\"\",H91*Parametrit!$B$6,\"\")","v":""},null,null,{"$f":"IF((J91*Parametrit!$B$4)+(K91*Parametrit!$B$5)=0,\"\",(J91*Parametrit!$B$4)+(K91*Parametrit!$B$5))","v":""},null,{"$f":"IF(A91<>\"\",I91+(J91*Parametrit!$B$4)+(K91*Parametrit!$B$5)+M91,\"\")","v":""}]
[null,"",{"$f":"IF(D92<>\"\",VLOOKUP(D92,Asiakkaat!$A$2:$E$244,2,FALSE),\"\")","v":""},null,null,{"$f":"IF(D92<>\"\",VLOOKUP(D92,Asiakkaat!$A$2:$E$244,3,FALSE),\"\")","v":""},{"$f":"IF(D92<>\"\",VLOOKUP(D92,Asiakkaat!$A$2:$E$100,4,FALSE),\"\")","v":""},{"$f":"IF(D92<>\"\",VLOOKUP(D92,Asiakkaat!$A$2:$E$394,5,FALSE)*2,\"\")","v":""},{"$f":"IF(D92<>\"\",H92*Parametrit!$B$6,\"\")","v":""},null,null,{"$f":"IF((J92*Parametrit!$B$4)+(K92*Parametrit!$B$5)=0,\"\",(J92*Parametrit!$B$4)+(K92*Parametrit!$B$5))","v":""},null,{"$f":"IF(A92<>\"\",I92+(J92*Parametrit!$B$4)+(K92*Parametrit!$B$5)+M92,\"\")","v":""}]
[null,"",{"$f":"IF(D93<>\"\",VLOOKUP(D93,Asiakkaat!$A$2:$E$244,2,FALSE),\"\")","v":""},null,null,{"$f":"IF(D93<>\"\",VLOOKUP(D93,Asiakkaat!$A$2:$E$244,3,FALSE),\"\")","v":""},{"$f":"IF(D93<>\"\",VLOOKUP(D93,Asiakkaat!$A$2:$E$100,4,FALSE),\"\")","v":""},{"$f":"IF(D93<>\"\",VLOOKUP(D93,Asiakkaat!$A$2:$E$394,5,FALSE)*2,\"\")","v":""},{"$f":"IF(D93<>\"\",H93*Parametrit!$B$6,\"\")","v":""},null,null,{"$f":"IF((J93*Parametrit!$B$4)+(K93*Parametrit!$B$5)=0,\"\",(J93*Parametrit!$B$4)+(K93*Parametrit!$B$5))","v":""},null,{"$f":"IF(A93<>\"\",I93+(J93*Parametrit!$B$4)+(K93*Parametrit!$B$5)+M93,\"\")","v":""}]
[null,"",{"$f":"IF(D94<>\"\",VLOOKUP(D94,Asiakkaat!$A$2:$E$244,2,FALSE),\"\")","v":""},null,null,{"$f":"IF(D94<>\"\",VLOOKUP(D94,Asiakkaat!$A$2:$E$244,3,FALSE),\"\")","v":""},{"$f":"IF(D94<>\"\",VLOOKUP(D94,Asiakkaat!$A$2:$E$100,4,FALSE),\"\")","v":""},{"$f":"IF(D94<>\"\",VLOOKUP(D94,Asiakkaat!$A$2:$E$394,5,FALSE)*2,\"\")","v":""},{"$f":"IF(D94<>\"\",H94*Parametrit!$B$6,\"\")","v":""},null,null,{"$f":"IF((J94*Parametrit!$B$4)+(K94*Parametrit!$B$5)=0,\"\",(J94*Parametrit!$B$4)+(K94*Parametrit!$B$5))","v":""},null,{"$f":"IF(A94<>\"\",I94+(J94*Parametrit!$B$4)+(K94*Parametrit!$B$5)+M94,\"\")","v":""}]
[null,"",{"$f":"IF(D95<>\"\",VLOOKUP(D95,Asiakkaat!$A$2:$E$244,2,FALSE),\"\")","v":""},null,null,{"$f":"IF(D95<>\"\",VLOOKUP(D95,Asiakkaat!$A$2:$E$244,3,FALSE),\"\")","v":""},{"$f":"IF(D95<>\"\",VLOOKUP(D95,Asiakkaat!$A$2:$E$100,4,FALSE),\"\")","v":""},{"$f":"IF(D95<>\"\",VLOOKUP(D95,Asiakkaat!$A$2:$E$394,5,FALSE)*2,\"\")","v":""},{"$f":"IF(D95<>\"\",H95*Parametrit!$B$6,\"\")","v":""},null,null,{"$f":"IF((J95*Parametrit!$B$4)+(K95*Parametrit!$B$5)=0,\"\",(J95*Parametrit!$B$4)+(K95*Parametrit!$B$5))","v":""},null,{"$f":"IF(A95<>\"\",I95+(J95*Parametrit!$B$4)+(K95*Parametrit!$B$5)+M95,\"\")","v":""}]
[null,"",{"$f":"IF(D96<>\"\",VLOOKUP(D96,Asiakkaat!$A$2:$E$244,2,FALSE),\"\")","v":""},null,null,{"$f":"IF(D96<>\"\",VLOOKUP(D96,Asiakkaat!$A$2:$E$244,3,FALSE),\"\")","v":""},{"$f":"IF(D96<>\"\",VLOOKUP(D96,Asiakkaat!$A$2:$E$100,4,FALSE),\"\")","v":""},{"$f":"IF(D96<>\"\",VLOOKUP(D96,Asiakkaat!$A$2:$E$394,5,FALSE)*2,\"\")","v":""},{"$f":"IF(D96<>\"\",H96*Parametrit!$B$6,\"\")","v":""},null,null,{"$f":"IF((J96*Parametrit!$B$4)+(K96*Parametrit!$B$5)=0,\"\",(J96*Parametrit!$B$4)+(K96*Parametrit!$B$5))","v":""},null,{"$f":"IF(A96<>\"\",I96+(J96*Parametrit!$B$4)+(K96*Parametrit!$B$5)+M96,\"\")","v":""}]
[null,"",{"$f":"IF(D97<>\"\",VLOOKUP(D97,Asiakkaat!$A$2:$E$244,2,FALSE),\"\")","v":""},null,null,{"$f":"IF(D97<>\"\",VLOOKUP(D97,Asiakkaat!$A$2:$E$244,3,FALSE),\"\")","v":""},{"$f":"IF(D97<>\"\",VLOOKUP(D97,Asiakkaat!$A$2:$E$100,4,FALSE),\"\")","v":""},{"$f":"IF(D97<>\"\",VLOOKUP(D97,Asiakkaat!$A$2:$E$394,5,FALSE)*2,\"\")","v":""},{"$f":"IF(D97<>\"\",H97*Parametrit!$B$6,\"\")","v":""},null,null,{"$f":"IF((J97*Parametrit!$B$4)+(K97*Parametrit!$B$5)=0,\"\",(J97*Parametrit!$B$4)+(K97*Parametrit!$B$5))","v":""},null,{"$f":"IF(A97<>\"\",I97+(J97*Parametrit!$B$4)+(K97*Parametrit!$B$5)+M97,\"\")","v":""}]
[null,"",{"$f":"IF(D98<>\"\",VLOOKUP(D98,Asiakkaat!$A$2:$E$244,2,FALSE),\"\")","v":""},null,null,{"$f":"IF(D98<>\"\",VLOOKUP(D98,Asiakkaat!$A$2:$E$244,3,FALSE),\"\")","v":""},{"$f":"IF(D98<>\"\",VLOOKUP(D98,Asiakkaat!$A$2:$E$100,4,FALSE),\"\")","v":""},{"$f":"IF(D98<>\"\",VLOOKUP(D98,Asiakkaat!$A$2:$E$394,5,FALSE)*2,\"\")","v":""},{"$f":"IF(D98<>\"\",H98*Parametrit!$B$6,\"\")","v":""},null,null,{"$f":"IF((J98*Parametrit!$B$4)+(K98*Parametrit!$B$5)=0,\"\",(J98*Parametrit!$B$4)+(K98*Parametrit!$B$5))","v":""},null,{"$f":"IF(A98<>\"\",I98+(J98*Parametrit!$B$4)+(K98*Parametrit!$B$5)+M98,\"\")","v":""}]
[null,{"$f":"IF(A99<>\"\",IFERROR(WEEKDAY(A99),\"\"),\"\")","v":""},{"$f":"IF(D99<>\"\",VLOOKUP(D99,Asiakkaat!$A$2:$E$244,2,FALSE),\"\")","v":""},null,null,{"$f":"IF(D99<>\"\",VLOOKUP(D99,Asiakkaat!$A$2:$E$244,3,FALSE),\"\")","v":""},{"$f":"IF(D99<>\"\",VLOOKUP(D99,Asiakkaat!$A$2:$E$100,4,FALSE),\"\")","v":""},{"$f":"IF(D99<>\"\",VLOOKUP(D99,Asiakkaat!$A$2:$E$394,5,FALSE)*2,\"\")","v":""},{"$f":"IF(D99<>\"\",H99*Parametrit!$B$6,\"\")","v":""},null,null,{"$f":"IF((J99*Parametrit!$B$4)+(K99*Parametrit!$B$5)=0,\"\",(J99*Parametrit!$B$4)+(K99*Parametrit!$B$5))","v":""},null,{"$f":"IF(A99<>\"\",I99+(J99*Parametrit!$B$4)+(K99*Parametrit!$B$5)+M99,\"\")","v":""}]
[null,"",{"$f":"IF(D100<>\"\",VLOOKUP(D100,Asiakkaat!$A$2:$E$244,2,FALSE),\"\")","v":""},null,null,{"$f":"IF(D100<>\"\",VLOOKUP(D100,Asiakkaat!$A$2:$E$244,3,FALSE),\"\")","v":""},{"$f":"IF(D100<>\"\",VLOOKUP(D100,Asiakkaat!$A$2:$E$100,4,FALSE),\"\")","v":""},{"$f":"IF(D100<>\"\",VLOOKUP(D100,Asiakkaat!$A$2:$E$394,5,FALSE)*2,\"\")","v":""},{"$f":"IF(D100<>\"\",H100*Parametrit!$B$6,\"\")","v":""},null,null,{"$f":"IF((J100*Parametrit!$B$4)+(K100*Parametrit!$B$5)=0,\"\",(J100*Parametrit!$B$4)+(K100*Parametrit!$B$5))","v":""},null,{"$f":"IF(A100<>\"\",I100+(J100*Parametrit!$B$4)+(K100*Parametrit!$B$5)+M100,\"\")","v":""}]
[null,"",{"$f":"IF(D101<>\"\",VLOOKUP(D101,Asiakkaat!$A$2:$E$244,2,FALSE),\"\")","v":""},null,null,{"$f":"IF(D101<>\"\",VLOOKUP(D101,Asiakkaat!$A$2:$E$244,3,FALSE),\"\")","v":""},{"$f":"IF(D101<>\"\",VLOOKUP(D101,Asiakkaat!$A$2:$E$100,4,FALSE),\"\")","v":""},{"$f":"IF(D101<>\"\",VLOOKUP(D101,Asiakkaat!$A$2:$E$394,5,FALSE)*2,\"\")","v":""},{"$f":"IF(D101<>\"\",H101*Parametrit!$B$6,\"\")","v":""},null,null,{"$f":"IF((J101*Parametrit!$B$4)+(K101*Parametrit!$B$5)=0,\"\",(J101*Parametrit!$B$4)+(K101*Parametrit!$B$5))","v":""},null,{"$f":"IF(A101<>\"\",I101+(J101*Parametrit!$B$4)+(K101*Parametrit!$B$5)+M101,\"\")","v":""}]
[null,"",{"$f":"IF(D102<>\"\",VLOOKUP(D102,Asiakkaat!$A$2:$E$244,2,FALSE),\"\")","v":""},null,null,{"$f":"IF(D102<>\"\",VLOOKUP(D102,Asiakkaat!$A$2:$E$244,3,FALSE),\"\")","v":""},{"$f":"IF(D102<>\"\",VLOOKUP(D102,Asiakkaat!$A$2:$E$100,4,FALSE),\"\")","v":""},{"$f":"IF(D102<>\"\",VLOOKUP(D102,Asiakkaat!$A$2:$E$394,5,FALSE)*2,\"\")","v":""},{"$f":"IF(D102<>\"\",H102*Parametrit!$B$6,\"\")","v":""},null,null,{"$f":"IF((J102*Parametrit!$B$4)+(K102*Parametrit!$B$5)=0,\"\",(J102*Parametrit!$B$4)+(K102*Parametrit!$B$5))","v":""},null,{"$f":"IF(A102<>\"\",I102+(J102*Parametrit!$B$4)+(K102*Parametrit!$B$5)+M102,\"\")","v":""}]
[null,"",{"$f":"IF(D103<>\"\",VLOOKUP(D103,Asiakkaat!$A$2:$E$244,2,FALSE),\"\")","v":""},null,null,{"$f":"IF(D103<>\"\",VLOOKUP(D103,Asiakkaat!$A$2:$E$244,3,FALSE),\"\")","v":""},{"$f":"IF(D103<>\"\",VLOOKUP(D103,Asiakkaat!$A$2:$E$100,4,FALSE),\"\")","v":""},{"$f":"IF(D103<>\"\",VLOOKUP(D103,Asiakkaat!$A$2:$E$394,5,FALSE)*2,\"\")","v":""},{"$f":"IF(D103<>\"\",H103*Parametrit!$B$6,\"\")","v":""},null,null,{"$f":"IF((J103*Parametrit!$B$4)+(K103*Parametrit!$B$5)=0,\"\",(J103*Parametrit!$B$4)+(K103*Parametrit!$B$5))","v":""},null,{"$f":"IF(A103<>\"\",I103+(J103*Parametrit!$B$4)+(K103*Parametrit!$B$5)+M103,\"\")","v":""}]
[null,"",{"$f":"IF(D104<>\"\",VLOOKUP(D104,Asiakkaat!$A$2:$E$244,2,FALSE),\"\")","v":""},null,null,{"$f":"IF(D104<>\"\",VLOOKUP(D104,Asiakkaat!$A$2:$E$244,3,FALSE),\"\")","v":""},{"$f":"IF(D104<>\"\",VLOOKUP(D104,Asiakkaat!$A$2:$E$100,4,FALSE),\"\")","v":""},{"$f":"IF(D104<>\"\",VLOOKUP(D104,Asiakkaat!$A$2:$E$394,5,FALSE)*2,\"\")","v":""},{"$f":"IF(D104<>\"\",H104*Parametrit!$B$6,\"\")","v":""},null,null,{"$f":"IF((J104*Parametrit!$B$4)+(K104*Parametrit!$B$5)=0,\"\",(J104*Parametrit!$B$4)+(K104*Parametrit!$B$5))","v":""},null,{"$f":"IF(A104<>\"\",I104+(J104*Parametrit!$B$4)+(K104*Parametrit!$B$5)+M104,\"\")","v":""}]
[null,"",{"$f":"IF(D105<>\"\",VLOOKUP(D105,Asiakkaat!$A$2:$E$244,2,FALSE),\"\")","v":""},null,null,{"$f":"IF(D105<>\"\",VLOOKUP(D105,Asiakkaat!$A$2:$E$244,3,FALSE),\"\")","v":""},{"$f":"IF(D105<>\"\",VLOOKUP(D105,Asiakkaat!$A$2:$E$100,4,FALSE),\"\")","v":""},{"$f":"IF(D105<>\"\",VLOOKUP(D105,Asiakkaat!$A$2:$E$394,5,FALSE)*2,\"\")","v":""},{"$f":"IF(D105<>\"\",H105*Parametrit!$B$6,\"\")","v":""},null,null,{"$f":"IF((J105*Parametrit!$B$4)+(K105*Parametrit!$B$5)=0,\"\",(J105*Parametrit!$B$4)+(K105*Parametrit!$B$5))","v":""},null,{"$f":"IF(A105<>\"\",I105+(J105*Parametrit!$B$4)+(K105*Parametrit!$B$5)+M105,\"\")","v":""}]
[null,"",{"$f":"IF(D106<>\"\",VLOOKUP(D106,Asiakkaat!$A$2:$E$244,2,FALSE),\"\")","v":""},null,null,{"$f":"IF(D106<>\"\",VLOOKUP(D106,Asiakkaat!$A$2:$E$244,3,FALSE),\"\")","v":""},{"$f":"IF(D106<>\"\",VLOOKUP(D106,Asiakkaat!$A$2:$E$100,4,FALSE),\"\")","v":""},{"$f":"IF(D106<>\"\",VLOOKUP(D106,Asiakkaat!$A$2:$E$394,5,FALSE)*2,\"\")","v":""},{"$f":"IF(D106<>\"\",H106*Parametrit!$B$6,\"\")","v":""},null,null,{"$f":"IF((J106*Parametrit!$B$4)+(K106*Parametrit!$B$5)=0,\"\",(J106*Parametrit!$B$4)+(K106*Parametrit!$B$5))","v":""},null,{"$f":"IF(A106<>\"\",I106+(J106*Parametrit!$B$4)+(K106*Parametrit!$B$5)+M106,\"\")","v":""}]
[null,"",{"$f":"IF(D107<>\"\",VLOOKUP(D107,Asiakkaat!$A$2:$E$244,2,FALSE),\"\")","v":""},null,null,{"$f":"IF(D107<>\"\",VLOOKUP(D107,Asiakkaat!$A$2:$E$244,3,FALSE),\"\")","v":""},{"$f":"IF(D107<>\"\",VLOOKUP(D107,Asiakkaat!$A$2:$E$100,4,FALSE),\"\")","v":""},{"$f":"IF(D107<>\"\",VLOOKUP(D107,Asiakkaat!$A$2:$E$394,5,FALSE)*2,\"\")","v":""},{"$f":"IF(D107<>\"\",H107*Parametrit!$B$6,\"\")","v":""},null,null,{"$f":"IF((J107*Parametrit!$B$4)+(K107*Parametrit!$B$5)=0,\"\",(J107*Parametrit!$B$4)+(K107*Parametrit!$B$5))","v":""},null,{"$f":"IF(A107<>\"\",I107+(J107*Parametrit!$B$4)+(K107*Parametrit!$B$5)+M107,\"\")","v":""}]
[null,"",{"$f":"IF(D108<>\"\",VLOOKUP(D108,Asiakkaat!$A$2:$E$244,2,FALSE),\"\")","v":""},null,null,{"$f":"IF(D108<>\"\",VLOOKUP(D108,Asiakkaat!$A$2:$E$244,3,FALSE),\"\")","v":""},{"$f":"IF(D108<>\"\",VLOOKUP(D108,Asiakkaat!$A$2:$E$100,4,FALSE),\"\")","v":""},{"$f":"IF(D108<>\"\",VLOOKUP(D108,Asiakkaat!$A$2:$E$394,5,FALSE)*2,\"\")","v":""},{"$f":"IF(D108<>\"\",H108*Parametrit!$B$6,\"\")","v":""},null,null,{"$f":"IF((J108*Parametrit!$B$4)+(K108*Parametrit!$B$5)=0,\"\",(J108*Parametrit!$B$4)+(K108*Parametrit!$B$5))","v":""},null,{"$f":"IF(A108<>\"\",I108+(J108*Parametrit!$B$4)+(K108*Parametrit!$B$5)+M108,\"\")","v":""}]
[null,"",{"$f":"IF(D109<>\"\",VLOOKUP(D109,Asiakkaat!$A$2:$E$244,2,FALSE),\"\")","v":""},null,null,{"$f":"IF(D109<>\"\",VLOOKUP(D109,Asiakkaat!$A$2:$E$244,3,FALSE),\"\")","v":""},{"$f":"IF(D109<>\"\",VLOOKUP(D109,Asiakkaat!$A$2:$E$100,4,FALSE),\"\")","v":""},{"$f":"IF(D109<>\"\",VLOOKUP(D109,Asiakkaat!$A$2:$E$394,5,FALSE)*2,\"\")","v":""},{"$f":"IF(D109<>\"\",H109*Parametrit!$B$6,\"\")","v":""},null,null,{"$f":"IF((J109*Parametrit!$B$4)+(K109*Parametrit!$B$5)=0,\"\",(J109*Parametrit!$B$4)+(K109*Parametrit!$B$5))","v":""},null,{"$f":"IF(A109<>\"\",I109+(J109*Parametrit!$B$4)+(K109*Parametrit!$B$5)+M109,\"\")","v":""}]
[null,"",{"$f":"IF(D110<>\"\",VLOOKUP(D110,Asiakkaat!$A$2:$E$244,2,FALSE),\"\")","v":""},null,null,{"$f":"IF(D110<>\"\",VLOOKUP(D110,Asiakkaat!$A$2:$E$244,3,FALSE),\"\")","v":""},{"$f":"IF(D110<>\"\",VLOOKUP(D110,Asiakkaat!$A$2:$E$100,4,FALSE),\"\")","v":""},{"$f":"IF(D110<>\"\",VLOOKUP(D110,Asiakkaat!$A$2:$E$394,5,FALSE)*2,\"\")","v":""},{"$f":"IF(D110<>\"\",H110*Parametrit!$B$6,\"\")","v":""},null,null,{"$f":"IF((J110*Parametrit!$B$4)+(K110*Parametrit!$B$5)=0,\"\",(J110*Parametrit!$B$4)+(K110*Parametrit!$B$5))","v":""},null,{"$f":"IF(A110<>\"\",I110+(J110*Parametrit!$B$4)+(K110*Parametrit!$B$5)+M110,\"\")","v":""}]
[null,"",{"$f":"IF(D111<>\"\",VLOOKUP(D111,Asiakkaat!$A$2:$E$244,2,FALSE),\"\")","v":""},null,null,{"$f":"IF(D111<>\"\",VLOOKUP(D111,Asiakkaat!$A$2:$E$244,3,FALSE),\"\")","v":""},{"$f":"IF(D111<>\"\",VLOOKUP(D111,Asiakkaat!$A$2:$E$100,4,FALSE),\"\")","v":""},{"$f":"IF(D111<>\"\",VLOOKUP(D111,Asiakkaat!$A$2:$E$394,5,FALSE)*2,\"\")","v":""},{"$f":"IF(D111<>\"\",H111*Parametrit!$B$6,\"\")","v":""},null,null,{"$f":"IF((J111*Parametrit!$B$4)+(K111*Parametrit!$B$5)=0,\"\",(J111*Parametrit!$B$4)+(K111*Parametrit!$B$5))","v":""},null,{"$f":"IF(A111<>\"\",I111+(J111*Parametrit!$B$4)+(K111*Parametrit!$B$5)+M111,\"\")","v":""}]
[null,"",{"$f":"IF(D112<>\"\",VLOOKUP(D112,Asiakkaat!$A$2:$E$244,2,FALSE),\"\")","v":""},null,null,{"$f":"IF(D112<>\"\",VLOOKUP(D112,Asiakkaat!$A$2:$E$244,3,FALSE),\"\")","v":""},{"$f":"IF(D112<>\"\",VLOOKUP(D112,Asiakkaat!$A$2:$E$100,4,FALSE),\"\")","v":""},{"$f":"IF(D112<>\"\",VLOOKUP(D112,Asiakkaat!$A$2:$E$394,5,FALSE)*2,\"\")","v":""},{"$f":"IF(D112<>\"\",H112*Parametrit!$B$6,\"\")","v":""},null,null,{"$f":"IF((J112*Parametrit!$B$4)+(K112*Parametrit!$B$5)=0,\"\",(J112*Parametrit!$B$4)+(K112*Parametrit!$B$5))","v":""},null,{"$f":"IF(A112<>\"\",I112+(J112*Parametrit!$B$4)+(K112*Parametrit!$B$5)+M112,\"\")","v":""}]
[null,"",{"$f":"IF(D113<>\"\",VLOOKUP(D113,Asiakkaat!$A$2:$E$244,2,FALSE),\"\")","v":""},null,null,{"$f":"IF(D113<>\"\",VLOOKUP(D113,Asiakkaat!$A$2:$E$244,3,FALSE),\"\")","v":""},{"$f":"IF(D113<>\"\",VLOOKUP(D113,Asiakkaat!$A$2:$E$100,4,FALSE),\"\")","v":""},{"$f":"IF(D113<>\"\",VLOOKUP(D113,Asiakkaat!$A$2:$E$394,5,FALSE)*2,\"\")","v":""},{"$f":"IF(D113<>\"\",H113*Parametrit!$B$6,\"\")","v":""},null,null,{"$f":"IF((J113*Parametrit!$B$4)+(K113*Parametrit!$B$5)=0,\"\",(J113*Parametrit!$B$4)+(K113*Parametrit!$B$5))","v":""},null,{"$f":"IF(A113<>\"\",I113+(J113*Parametrit!$B$4)+(K113*Parametrit!$B$5)+M113,\"\")","v":""}]
[null,"",{"$f":"IF(D114<>\"\",VLOOKUP(D114,Asiakkaat!$A$2:$E$244,2,FALSE),\"\")","v":""},null,null,{"$f":"IF(D114<>\"\",VLOOKUP(D114,Asiakkaat!$A$2:$E$244,3,FALSE),\"\")","v":""},{"$f":"IF(D114<>\"\",VLOOKUP(D114,Asiakkaat!$A$2:$E$100,4,FALSE),\"\")","v":""},{"$f":"IF(D114<>\"\",VLOOKUP(D114,Asiakkaat!$A$2:$E$394,5,FALSE)*2,\"\")","v":""},{"$f":"IF(D114<>\"\",H114*Parametrit!$B$6,\"\")","v":""},null,null,{"$f":"IF((J114*Parametrit!$B$4)+(K114*Parametrit!$B$5)=0,\"\",(J114*Parametrit!$B$4)+(K114*Parametrit!$B$5))","v":""},null,{"$f":"IF(A114<>\"\",I114+(J114*Parametrit!$B$4)+(K114*Parametrit!$B$5)+M114,\"\")","v":""}]
[null,"",{"$f":"IF(D115<>\"\",VLOOKUP(D115,Asiakkaat!$A$2:$E$244,2,FALSE),\"\")","v":""},null,null,{"$f":"IF(D115<>\"\",VLOOKUP(D115,Asiakkaat!$A$2:$E$244,3,FALSE),\"\")","v":""},{"$f":"IF(D115<>\"\",VLOOKUP(D115,Asiakkaat!$A$2:$E$100,4,FALSE),\"\")","v":""},{"$f":"IF(D115<>\"\",VLOOKUP(D115,Asiakkaat!$A$2:$E$394,5,FALSE)*2,\"\")","v":""},{"$f":"IF(D115<>\"\",H115*Parametrit!$B$6,\"\")","v":""},null,null,{"$f":"IF((J115*Parametrit!$B$4)+(K115*Parametrit!$B$5)=0,\"\",(J115*Parametrit!$B$4)+(K115*Parametrit!$B$5))","v":""},null,{"$f":"IF(A115<>\"\",I115+(J115*Parametrit!$B$4)+(K115*Parametrit!$B$5)+M115,\"\")","v":""}]
[null,"",{"$f":"IF(D116<>\"\",VLOOKUP(D116,Asiakkaat!$A$2:$E$244,2,FALSE),\"\")","v":""},null,null,{"$f":"IF(D116<>\"\",VLOOKUP(D116,Asiakkaat!$A$2:$E$244,3,FALSE),\"\")","v":""},{"$f":"IF(D116<>\"\",VLOOKUP(D116,Asiakkaat!$A$2:$E$100,4,FALSE),\"\")","v":""},{"$f":"IF(D116<>\"\",VLOOKUP(D116,Asiakkaat!$A$2:$E$394,5,FALSE)*2,\"\")","v":""},{"$f":"IF(D116<>\"\",H116*Parametrit!$B$6,\"\")","v":""},null,null,{"$f":"IF((J116*Parametrit!$B$4)+(K116*Parametrit!$B$5)=0,\"\",(J116*Parametrit!$B$4)+(K116*Parametrit!$B$5))","v":""},null,{"$f":"IF(A116<>\"\",I116+(J116*Parametrit!$B$4)+(K116*Parametrit!$B$5)+M116,\"\")","v":""}]
[null,"",{"$f":"IF(D117<>\"\",VLOOKUP(D117,Asiakkaat!$A$2:$E$244,2,FALSE),\"\")","v":""},null,null,{"$f":"IF(D117<>\"\",VLOOKUP(D117,Asiakkaat!$A$2:$E$244,3,FALSE),\"\")","v":""},{"$f":"IF(D117<>\"\",VLOOKUP(D117,Asiakkaat!$A$2:$E$100,4,FALSE),\"\")","v":""},{"$f":"IF(D117<>\"\",VLOOKUP(D117,Asiakkaat!$A$2:$E$394,5,FALSE)*2,\"\")","v":""},{"$f":"IF(D117<>\"\",H117*Parametrit!$B$6,\"\")","v":""},null,null,{"$f":"IF((J117*Parametrit!$B$4)+(K117*Parametrit!$B$5)=0,\"\",(J117*Parametrit!$B$4)+(K117*Parametrit!$B$5))","v":""},null,{"$f":"IF(A117<>\"\",I117+(J117*Parametrit!$B$4)+(K117*Parametrit!$B$5)+M117,\"\")","v":""}]
[null,"",{"$f":"IF(D118<>\"\",VLOOKUP(D118,Asiakkaat!$A$2:$E$244,2,FALSE),\"\")","v":""},null,null,{"$f":"IF(D118<>\"\",VLOOKUP(D118,Asiakkaat!$A$2:$E$244,3,FALSE),\"\")","v":""},{"$f":"IF(D118<>\"\",VLOOKUP(D118,Asiakkaat!$A$2:$E$100,4,FALSE),\"\")","v":""},{"$f":"IF(D118<>\"\",VLOOKUP(D118,Asiakkaat!$A$2:$E$394,5,FALSE)*2,\"\")","v":""},{"$f":"IF(D118<>\"\",H118*Parametrit!$B$6,\"\")","v":""},null,null,{"$f":"IF((J118*Parametrit!$B$4)+(K118*Parametrit!$B$5)=0,\"\",(J118*Parametrit!$B$4)+(K118*Parametrit!$B$5))","v":""},null,{"$f":"IF(A118<>\"\",I118+(J118*Parametrit!$B$4)+(K118*Parametrit!$B$5)+M118,\"\")","v":""}]
[null,"",{"$f":"IF(D119<>\"\",VLOOKUP(D119,Asiakkaat!$A$2:$E$244,2,FALSE),\"\")","v":""},null,null,{"$f":"IF(D119<>\"\",VLOOKUP(D119,Asiakkaat!$A$2:$E$244,3,FALSE),\"\")","v":""},{"$f":"IF(D119<>\"\",VLOOKUP(D119,Asiakkaat!$A$2:$E$100,4,FALSE),\"\")","v":""},{"$f":"IF(D119<>\"\",VLOOKUP(D119,Asiakkaat!$A$2:$E$394,5,FALSE)*2,\"\")","v":""},{"$f":"IF(D119<>\"\",H119*Parametrit!$B$6,\"\")","v":""},null,null,{"$f":"IF((J119*Parametrit!$B$4)+(K119*Parametrit!$B$5)=0,\"\",(J119*Parametrit!$B$4)+(K119*Parametrit!$B$5))","v":""},null,{"$f":"IF(A119<>\"\",I119+(J119*Parametrit!$B$4)+(K119*Parametrit!$B$5)+M119,\"\")","v":""}]
[null,"",{"$f":"IF(D120<>\"\",VLOOKUP(D120,Asiakkaat!$A$2:$E$244,2,FALSE),\"\")","v":""},null,null,{"$f":"IF(D120<>\"\",VLOOKUP(D120,Asiakkaat!$A$2:$E$244,3,FALSE),\"\")","v":""},{"$f":"IF(D120<>\"\",VLOOKUP(D120,Asiakkaat!$A$2:$E$100,4,FALSE),\"\")","v":""},{"$f":"IF(D120<>\"\",VLOOKUP(D120,Asiakkaat!$A$2:$E$394,5,FALSE)*2,\"\")","v":""},{"$f":"IF(D120<>\"\",H120*Parametrit!$B$6,\"\")","v":""},null,null,{"$f":"IF((J120*Parametrit!$B$4)+(K120*Parametrit!$B$5)=0,\"\",(J120*Parametrit!$B$4)+(K120*Parametrit!$B$5))","v":""},null,{"$f":"IF(A120<>\"\",I120+(J120*Parametrit!$B$4)+(K120*Parametrit!$B$5)+M120,\"\")","v":""}]
[null,"",{"$f":"IF(D121<>\"\",VLOOKUP(D121,Asiakkaat!$A$2:$E$244,2,FALSE),\"\")","v":""},null,null,{"$f":"IF(D121<>\"\",VLOOKUP(D121,Asiakkaat!$A$2:$E$244,3,FALSE),\"\")","v":""},{"$f":"IF(D121<>\"\",VLOOKUP(D121,Asiakkaat!$A$2:$E$100,4,FALSE),\"\")","v":""},{"$f":"IF(D121<>\"\",VLOOKUP(D121,Asiakkaat!$A$2:$E$394,5,FALSE)*2,\"\")","v":""},{"$f":"IF(D121<>\"\",H121*Parametrit!$B$6,\"\")","v":""},null,null,{"$f":"IF((J121*Parametrit!$B$4)+(K121*Parametrit!$B$5)=0,\"\",(J121*Parametrit!$B$4)+(K121*Parametrit!$B$5))","v":""},null,{"$f":"IF(A121<>\"\",I121+(J121*Parametrit!$B$4)+(K121*Parametrit!$B$5)+M121,\"\")","v":""}]
[null,"",{"$f":"IF(D122<>\"\",VLOOKUP(D122,Asiakkaat!$A$2:$E$244,2,FALSE),\"\")","v":""},null,null,{"$f":"IF(D122<>\"\",VLOOKUP(D122,Asiakkaat!$A$2:$E$244,3,FALSE),\"\")","v":""},{"$f":"IF(D122<>\"\",VLOOKUP(D122,Asiakkaat!$A$2:$E$100,4,FALSE),\"\")","v":""},{"$f":"IF(D122<>\"\",VLOOKUP(D122,Asiakkaat!$A$2:$E$394,5,FALSE)*2,\"\")","v":""},{"$f":"IF(D122<>\"\",H122*Parametrit!$B$6,\"\")","v":""},null,null,{"$f":"IF((J122*Parametrit!$B$4)+(K122*Parametrit!$B$5)=0,\"\",(J122*Parametrit!$B$4)+(K122*Parametrit!$B$5))","v":""},null,{"$f":"IF(A122<>\"\",I122+(J122*Parametrit!$B$4)+(K122*Parametrit!$B$5)+M122,\"\")","v":""}]
[null,"",{"$f":"IF(D123<>\"\",VLOOKUP(D123,Asiakkaat!$A$2:$E$244,2,FALSE),\"\")","v":""},null,null,{"$f":"IF(D123<>\"\",VLOOKUP(D123,Asiakkaat!$A$2:$E$244,3,FALSE),\"\")","v":""},{"$f":"IF(D123<>\"\",VLOOKUP(D123,Asiakkaat!$A$2:$E$100,4,FALSE),\"\")","v":""},{"$f":"IF(D123<>\"\",VLOOKUP(D123,Asiakkaat!$A$2:$E$394,5,FALSE)*2,\"\")","v":""},{"$f":"IF(D123<>\"\",H123*Parametrit!$B$6,\"\")","v":""},null,null,{"$f":"IF((J123*Parametrit!$B$4)+(K123*Parametrit!$B$5)=0,\"\",(J123*Parametrit!$B$4)+(K123*Parametrit!$B$5))","v":""},null,{"$f":"IF(A123<>\"\",I123+(J123*Parametrit!$B$4)+(K123*Parametrit!$B$5)+M123,\"\")","v":""}]
[null,"",{"$f":"IF(D124<>\"\",VLOOKUP(D124,Asiakkaat!$A$2:$E$244,2,FALSE),\"\")","v":""},null,null,{"$f":"IF(D124<>\"\",VLOOKUP(D124,Asiakkaat!$A$2:$E$244,3,FALSE),\"\")","v":""},{"$f":"IF(D124<>\"\",VLOOKUP(D124,Asiakkaat!$A$2:$E$100,4,FALSE),\"\")","v":""},{"$f":"IF(D124<>\"\",VLOOKUP(D124,Asiakkaat!$A$2:$E$394,5,FALSE)*2,\"\")","v":""},{"$f":"IF(D124<>\"\",H124*Parametrit!$B$6,\"\")","v":""},null,null,{"$f":"IF((J124*Parametrit!$B$4)+(K124*Parametrit!$B$5)=0,\"\",(J124*Parametrit!$B$4)+(K124*Parametrit!$B$5))","v":""},null,{"$f":"IF(A124<>\"\",I124+(J124*Parametrit!$B$4)+(K124*Parametrit!$B$5)+M124,\"\")","v":""}]
[null,"",{"$f":"IF(D125<>\"\",VLOOKUP(D125,Asiakkaat!$A$2:$E$244,2,FALSE),\"\")","v":""},null,null,{"$f":"IF(D125<>\"\",VLOOKUP(D125,Asiakkaat!$A$2:$E$244,3,FALSE),\"\")","v":""},{"$f":"IF(D125<>\"\",VLOOKUP(D125,Asiakkaat!$A$2:$E$100,4,FALSE),\"\")","v":""},{"$f":"IF(D125<>\"\",VLOOKUP(D125,Asiakkaat!$A$2:$E$394,5,FALSE)*2,\"\")","v":""},{"$f":"IF(D125<>\"\",H125*Parametrit!$B$6,\"\")","v":""},null,null,{"$f":"IF((J125*Parametrit!$B$4)+(K125*Parametrit!$B$5)=0,\"\",(J125*Parametrit!$B$4)+(K125*Parametrit!$B$5))","v":""},null,{"$f":"IF(A125<>\"\",I125+(J125*Parametrit!$B$4)+(K125*Parametrit!$B$5)+M125,\"\")","v":""}]
[null,"",{"$f":"IF(D126<>\"\",VLOOKUP(D126,Asiakkaat!$A$2:$E$244,2,FALSE),\"\")","v":""},null,null,{"$f":"IF(D126<>\"\",VLOOKUP(D126,Asiakkaat!$A$2:$E$244,3,FALSE),\"\")","v":""},{"$f":"IF(D126<>\"\",VLOOKUP(D126,Asiakkaat!$A$2:$E$100,4,FALSE),\"\")","v":""},{"$f":"IF(D126<>\"\",VLOOKUP(D126,Asiakkaat!$A$2:$E$394,5,FALSE)*2,\"\")","v":""},{"$f":"IF(D126<>\"\",H126*Parametrit!$B$6,\"\")","v":""},null,null,{"$f":"IF((J126*Parametrit!$B$4)+(K126*Parametrit!$B$5)=0,\"\",(J126*Parametrit!$B$4)+(K126*Parametrit!$B$5))","v":""},null,{"$f":"IF(A126<>\"\",I126+(J126*Parametrit!$B$4)+(K126*Parametrit!$B$5)+M126,\"\")","v":""}]
[null,"",{"$f":"IF(D127<>\"\",VLOOKUP(D127,Asiakkaat!$A$2:$E$244,2,FALSE),\"\")","v":""},null,null,{"$f":"IF(D127<>\"\",VLOOKUP(D127,Asiakkaat!$A$2:$E$244,3,FALSE),\"\")","v":""},{"$f":"IF(D127<>\"\",VLOOKUP(D127,Asiakkaat!$A$2:$E$100,4,FALSE),\"\")","v":""},{"$f":"IF(D127<>\"\",VLOOKUP(D127,Asiakkaat!$A$2:$E$394,5,FALSE)*2,\"\")","v":""},{"$f":"IF(D127<>\"\",H127*Parametrit!$B$6,\"\")","v":""},null,null,{"$f":"IF((J127*Parametrit!$B$4)+(K127*Parametrit!$B$5)=0,\"\",(J127*Parametrit!$B$4)+(K127*Parametrit!$B$5))","v":""},null,{"$f":"IF(A127<>\"\",I127+(J127*Parametrit!$B$4)+(K127*Parametrit!$B$5)+M127,\"\")","v":""}]
[null,"",{"$f":"IF(D128<>\"\",VLOOKUP(D128,Asiakkaat!$A$2:$E$244,2,FALSE),\"\")","v":""},null,null,{"$f":"IF(D128<>\"\",VLOOKUP(D128,Asiakkaat!$A$2:$E$244,3,FALSE),\"\")","v":""},{"$f":"IF(D128<>\"\",VLOOKUP(D128,Asiakkaat!$A$2:$E$100,4,FALSE),\"\")","v":""},{"$f":"IF(D128<>\"\",VLOOKUP(D128,Asiakkaat!$A$2:$E$394,5,FALSE)*2,\"\")","v":""},{"$f":"IF(D128<>\"\",H128*Parametrit!$B$6,\"\")","v":""},null,null,{"$f":"IF((J128*Parametrit!$B$4)+(K128*Parametrit!$B$5)=0,\"\",(J128*Parametrit!$B$4)+(K128*Parametrit!$B$5))","v":""},null,{"$f":"IF(A128<>\"\",I128+(J128*Parametrit!$B$4)+(K128*Parametrit!$B$5)+M128,\"\")","v":""}]
[null,{"$f":"IF(A129<>\"\",IFERROR(WEEKDAY(A129),\"\"),\"\")","v":""},{"$f":"IF(D129<>\"\",VLOOKUP(D129,Asiakkaat!$A$2:$E$244,2,FALSE),\"\")","v":""},null,null,{"$f":"IF(D129<>\"\",VLOOKUP(D129,Asiakkaat!$A$2:$E$244,3,FALSE),\"\")","v":""},{"$f":"IF(D129<>\"\",VLOOKUP(D129,Asiakkaat!$A$2:$E$100,4,FALSE),\"\")","v":""},{"$f":"IF(D129<>\"\",VLOOKUP(D129,Asiakkaat!$A$2:$E$394,5,FALSE)*2,\"\")","v":""},{"$f":"IF(D129<>\"\",H129*Parametrit!$B$6,\"\")","v":""},null,null,{"$f":"IF((J129*Parametrit!$B$4)+(K129*Parametrit!$B$5)=0,\"\",(J129*Parametrit!$B$4)+(K129*Parametrit!$B$5))","v":""},null,{"$f":"IF(A129<>\"\",I129+(J129*Parametrit!$B$4)+(K129*Parametrit!$B$5)+M129,\"\")","v":""}]
[null,"",{"$f":"IF(D130<>\"\",VLOOKUP(D130,Asiakkaat!$A$2:$E$244,2,FALSE),\"\")","v":""},null,null,{"$f":"IF(D130<>\"\",VLOOKUP(D130,Asiakkaat!$A$2:$E$244,3,FALSE),\"\")","v":""},{"$f":"IF(D130<>\"\",VLOOKUP(D130,Asiakkaat!$A$2:$E$100,4,FALSE),\"\")","v":""},{"$f":"IF(D130<>\"\",VLOOKUP(D130,Asiakkaat!$A$2:$E$394,5,FALSE)*2,\"\")","v":""},{"$f":"IF(D130<>\"\",H130*Parametrit!$B$6,\"\")","v":""},null,null,{"$f":"IF((J130*Parametrit!$B$4)+(K130*Parametrit!$B$5)=0,\"\",(J130*Parametrit!$B$4)+(K130*Parametrit!$B$5))","v":""},null,{"$f":"IF(A130<>\"\",I130+(J130*Parametrit!$B$4)+(K130*Parametrit!$B$5)+M130,\"\")","v":""}]
[null,"",{"$f":"IF(D131<>\"\",VLOOKUP(D131,Asiakkaat!$A$2:$E$244,2,FALSE),\"\")","v":""},null,null,{"$f":"IF(D131<>\"\",VLOOKUP(D131,Asiakkaat!$A$2:$E$244,3,FALSE),\"\")","v":""},{"$f":"IF(D131<>\"\",VLOOKUP(D131,Asiakkaat!$A$2:$E$100,4,FALSE),\"\")","v":""},{"$f":"IF(D131<>\"\",VLOOKUP(D131,Asiakkaat!$A$2:$E$394,5,FALSE)*2,\"\")","v":""},{"$f":"IF(D131<>\"\",H131*Parametrit!$B$6,\"\")","v":""},null,null,{"$f":"IF((J131*Parametrit!$B$4)+(K131*Parametrit!$B$5)=0,\"\",(J131*Parametrit!$B$4)+(K131*Parametrit!$B$5))","v":""},null,{"$f":"IF(A131<>\"\",I131+(J131*Parametrit!$B$4)+(K131*Parametrit!$B$5)+M131,\"\")","v":""}]
[null,"",{"$f":"IF(D132<>\"\",VLOOKUP(D132,Asiakkaat!$A$2:$E$244,2,FALSE),\"\")","v":""},null,null,{"$f":"IF(D132<>\"\",VLOOKUP(D132,Asiakkaat!$A$2:$E$244,3,FALSE),\"\")","v":""},{"$f":"IF(D132<>\"\",VLOOKUP(D132,Asiakkaat!$A$2:$E$100,4,FALSE),\"\")","v":""},{"$f":"IF(D132<>\"\",VLOOKUP(D132,Asiakkaat!$A$2:$E$394,5,FALSE)*2,\"\")","v":""},{"$f":"IF(D132<>\"\",H132*Parametrit!$B$6,\"\")","v":""},null,null,{"$f":"IF((J132*Parametrit!$B$4)+(K132*Parametrit!$B$5)=0,\"\",(J132*Parametrit!$B$4)+(K132*Parametrit!$B$5))","v":""},null,{"$f":"IF(A132<>\"\",I132+(J132*Parametrit!$B$4)+(K132*Parametrit!$B$5)+M132,\"\")","v":""}]
[null,"",{"$f":"IF(D133<>\"\",VLOOKUP(D133,Asiakkaat!$A$2:$E$244,2,FALSE),\"\")","v":""},null,null,{"$f":"IF(D133<>\"\",VLOOKUP(D133,Asiakkaat!$A$2:$E$244,3,FALSE),\"\")","v":""},{"$f":"IF(D133<>\"\",VLOOKUP(D133,Asiakkaat!$A$2:$E$100,4,FALSE),\"\")","v":""},{"$f":"IF(D133<>\"\",VLOOKUP(D133,Asiakkaat!$A$2:$E$394,5,FALSE)*2,\"\")","v":""},{"$f":"IF(D133<>\"\",H133*Parametrit!$B$6,\"\")","v":""},null,null,{"$f":"IF((J133*Parametrit!$B$4)+(K133*Parametrit!$B$5)=0,\"\",(J133*Parametrit!$B$4)+(K133*Parametrit!$B$5))","v":""},null,{"$f":"IF(A133<>\"\",I133+(J133*Parametrit!$B$4)+(K133*Parametrit!$B$5)+M133,\"\")","v":""}]
[null,"",{"$f":"IF(D134<>\"\",VLOOKUP(D134,Asiakkaat!$A$2:$E$244,2,FALSE),\"\")","v":""},null,null,{"$f":"IF(D134<>\"\",VLOOKUP(D134,Asiakkaat!$A$2:$E$244,3,FALSE),\"\")","v":""},{"$f":"IF(D134<>\"\",VLOOKUP(D134,Asiakkaat!$A$2:$E$100,4,FALSE),\"\")","v":""},{"$f":"IF(D134<>\"\",VLOOKUP(D134,Asiakkaat!$A$2:$E$394,5,FALSE)*2,\"\")","v":""},{"$f":"IF(D134<>\"\",H134*Parametrit!$B$6,\"\")","v":""},null,null,{"$f":"IF((J134*Parametrit!$B$4)+(K134*Parametrit!$B$5)=0,\"\",(J134*Parametrit!$B$4)+(K134*Parametrit!$B$5))","v":""},null,{"$f":"IF(A134<>\"\",I134+(J134*Parametrit!$B$4)+(K134*Parametrit!$B$5)+M134,\"\")","v":""}]
[null,{"$f":"IF(A135<>\"\",IFERROR(WEEKDAY(A135),\"\"),\"\")","v":""},{"$f":"IF(D135<>\"\",VLOOKUP(D135,Asiakkaat!$A$2:$E$244,2,FALSE),\"\")","v":""},null,null,{"$f":"IF(D135<>\"\",VLOOKUP(D135,Asiakkaat!$A$2:$E$244,3,FALSE),\"\")","v":""},{"$f":"IF(D135<>\"\",VLOOKUP(D135,Asiakkaat!$A$2:$E$100,4,FALSE),\"\")","v":""},{"$f":"IF(D135<>\"\",VLOOKUP(D135,Asiakkaat!$A$2:$E$394,5,FALSE)*2,\"\")","v":""},{"$f":"IF(D135<>\"\",H135*Parametrit!$B$6,\"\")","v":""},null,null,{"$f":"IF((J135*Parametrit!$B$4)+(K135*Parametrit!$B$5)=0,\"\",(J135*Parametrit!$B$4)+(K135*Parametrit!$B$5))","v":""},null,{"$f":"IF(A135<>\"\",I135+(J135*Parametrit!$B$4)+(K135*Parametrit!$B$5)+M135,\"\")","v":""}]
[null,"",{"$f":"IF(D136<>\"\",VLOOKUP(D136,Asiakkaat!$A$2:$E$244,2,FALSE),\"\")","v":""},null,null,{"$f":"IF(D136<>\"\",VLOOKUP(D136,Asiakkaat!$A$2:$E$244,3,FALSE),\"\")","v":""},{"$f":"IF(D136<>\"\",VLOOKUP(D136,Asiakkaat!$A$2:$E$100,4,FALSE),\"\")","v":""},{"$f":"IF(D136<>\"\",VLOOKUP(D136,Asiakkaat!$A$2:$E$394,5,FALSE)*2,\"\")","v":""},{"$f":"IF(D136<>\"\",H136*Parametrit!$B$6,\"\")","v":""},null,null,{"$f":"IF((J136*Parametrit!$B$4)+(K136*Parametrit!$B$5)=0,\"\",(J136*Parametrit!$B$4)+(K136*Parametrit!$B$5))","v":""},null,{"$f":"IF(A136<>\"\",I136+(J136*Parametrit!$B$4)+(K136*Parametrit!$B$5)+M136,\"\")","v":""}]
[null,"",{"$f":"IF(D137<>\"\",VLOOKUP(D137,Asiakkaat!$A$2:$E$244,2,FALSE),\"\")","v":""},null,null,{"$f":"IF(D137<>\"\",VLOOKUP(D137,Asiakkaat!$A$2:$E$244,3,FALSE),\"\")","v":""},{"$f":"IF(D137<>\"\",VLOOKUP(D137,Asiakkaat!$A$2:$E$100,4,FALSE),\"\")","v":""},{"$f":"IF(D137<>\"\",VLOOKUP(D137,Asiakkaat!$A$2:$E$394,5,FALSE)*2,\"\")","v":""},{"$f":"IF(D137<>\"\",H137*Parametrit!$B$6,\"\")","v":""},null,null,{"$f":"IF((J137*Parametrit!$B$4)+(K137*Parametrit!$B$5)=0,\"\",(J137*Parametrit!$B$4)+(K137*Parametrit!$B$5))","v":""},null,{"$f":"IF(A137<>\"\",I137+(J137*Parametrit!$B$4)+(K137*Parametrit!$B$5)+M137,\"\")","v":""}]
[null,"",{"$f":"IF(D138<>\"\",VLOOKUP(D138,Asiakkaat!$A$2:$E$244,2,FALSE),\"\")","v":""},null,null,{"$f":"IF(D138<>\"\",VLOOKUP(D138,Asiakkaat!$A$2:$E$244,3,FALSE),\"\")","v":""},{"$f":"IF(D138<>\"\",VLOOKUP(D138,Asiakkaat!$A$2:$E$100,4,FALSE),\"\")","v":""},{"$f":"IF(D138<>\"\",VLOOKUP(D138,Asiakkaat!$A$2:$E$394,5,FALSE)*2,\"\")","v":""},{"$f":"IF(D138<>\"\",H138*Parametrit!$B$6,\"\")","v":""},null,null,{"$f":"IF((J138*Parametrit!$B$4)+(K138*Parametrit!$B$5)=0,\"\",(J138*Parametrit!$B$4)+(K138*Parametrit!$B$5))","v":""},null,{"$f":"IF(A138<>\"\",I138+(J138*Parametrit!$B$4)+(K138*Parametrit!$B$5)+M138,\"\")","v":""}]
[null,"",{"$f":"IF(D139<>\"\",VLOOKUP(D139,Asiakkaat!$A$2:$E$244,2,FALSE),\"\")","v":""},null,null,{"$f":"IF(D139<>\"\",VLOOKUP(D139,Asiakkaat!$A$2:$E$244,3,FALSE),\"\")","v":""},{"$f":"IF(D139<>\"\",VLOOKUP(D139,Asiakkaat!$A$2:$E$100,4,FALSE),\"\")","v":""},{"$f":"IF(D139<>\"\",VLOOKUP(D139,Asiakkaat!$A$2:$E$394,5,FALSE)*2,\"\")","v":""},{"$f":"IF(D139<>\"\",H139*Parametrit!$B$6,\"\")","v":""},null,null,{"$f":"IF((J139*Parametrit!$B$4)+(K139*Parametrit!$B$5)=0,\"\",(J139*Parametrit!$B$4)+(K139*Parametrit!$B$5))","v":""},null,{"$f":"IF(A139<>\"\",I139+(J139*Parametrit!$B$4)+(K139*Parametrit!$B$5)+M139,\"\")","v":""}]
[null,"",{"$f":"IF(D140<>\"\",VLOOKUP(D140,Asiakkaat!$A$2:$E$244,2,FALSE),\"\")","v":""},null,null,{"$f":"IF(D140<>\"\",VLOOKUP(D140,Asiakkaat!$A$2:$E$244,3,FALSE),\"\")","v":""},{"$f":"IF(D140<>\"\",VLOOKUP(D140,Asiakkaat!$A$2:$E$100,4,FALSE),\"\")","v":""},{"$f":"IF(D140<>\"\",VLOOKUP(D140,Asiakkaat!$A$2:$E$394,5,FALSE)*2,\"\")","v":""},{"$f":"IF(D140<>\"\",H140*Parametrit!$B$6,\"\")","v":""},null,null,{"$f":"IF((J140*Parametrit!$B$4)+(K140*Parametrit!$B$5)=0,\"\",(J140*Parametrit!$B$4)+(K140*Parametrit!$B$5))","v":""},null,{"$f":"IF(A140<>\"\",I140+(J140*Parametrit!$B$4)+(K140*Parametrit!$B$5)+M140,\"\")","v":""}]
[null,"",{"$f":"IF(D141<>\"\",VLOOKUP(D141,Asiakkaat!$A$2:$E$244,2,FALSE),\"\")","v":""},null,null,{"$f":"IF(D141<>\"\",VLOOKUP(D141,Asiakkaat!$A$2:$E$244,3,FALSE),\"\")","v":""},{"$f":"IF(D141<>\"\",VLOOKUP(D141,Asiakkaat!$A$2:$E$100,4,FALSE),\"\")","v":""},{"$f":"IF(D141<>\"\",VLOOKUP(D141,Asiakkaat!$A$2:$E$394,5,FALSE)*2,\"\")","v":""},{"$f":"IF(D141<>\"\",H141*Parametrit!$B$6,\"\")","v":""},null,null,{"$f":"IF((J141*Parametrit!$B$4)+(K141*Parametrit!$B$5)=0,\"\",(J141*Parametrit!$B$4)+(K141*Parametrit!$B$5))","v":""},null,{"$f":"IF(A141<>\"\",I141+(J141*Parametrit!$B$4)+(K141*Parametrit!$B$5)+M141,\"\")","v":""}]
[null,"",{"$f":"IF(D142<>\"\",VLOOKUP(D142,Asiakkaat!$A$2:$E$244,2,FALSE),\"\")","v":""},null,null,{"$f":"IF(D142<>\"\",VLOOKUP(D142,Asiakkaat!$A$2:$E$244,3,FALSE),\"\")","v":""},{"$f":"IF(D142<>\"\",VLOOKUP(D142,Asiakkaat!$A$2:$E$100,4,FALSE),\"\")","v":""},{"$f":"IF(D142<>\"\",VLOOKUP(D142,Asiakkaat!$A$2:$E$394,5,FALSE)*2,\"\")","v":""},{"$f":"IF(D142<>\"\",H142*Parametrit!$B$6,\"\")","v":""},null,null,{"$f":"IF((J142*Parametrit!$B$4)+(K142*Parametrit!$B$5)=0,\"\",(J142*Parametrit!$B$4)+(K142*Parametrit!$B$5))","v":""},null,{"$f":"IF(A142<>\"\",I142+(J142*Parametrit!$B$4)+(K142*Parametrit!$B$5)+M142,\"\")","v":""}]
[null,"",{"$f":"IF(D143<>\"\",VLOOKUP(D143,Asiakkaat!$A$2:$E$244,2,FALSE),\"\")","v":""},null,null,{"$f":"IF(D143<>\"\",VLOOKUP(D143,Asiakkaat!$A$2:$E$244,3,FALSE),\"\")","v":""},{"$f":"IF(D143<>\"\",VLOOKUP(D143,Asiakkaat!$A$2:$E$100,4,FALSE),\"\")","v":""},{"$f":"IF(D143<>\"\",VLOOKUP(D143,Asiakkaat!$A$2:$E$394,5,FALSE)*2,\"\")","v":""},{"$f":"IF(D143<>\"\",H143*Parametrit!$B$6,\"\")","v":""},null,null,{"$f":"IF((J143*Parametrit!$B$4)+(K143*Parametrit!$B$5)=0,\"\",(J143*Parametrit!$B$4)+(K143*Parametrit!$B$5))","v":""},null,{"$f":"IF(A143<>\"\",I143+(J143*Parametrit!$B$4)+(K143*Parametrit!$B$5)+M143,\"\")","v":""}]
[null,"",{"$f":"IF(D144<>\"\",VLOOKUP(D144,Asiakkaat!$A$2:$E$244,2,FALSE),\"\")","v":""},null,null,{"$f":"IF(D144<>\"\",VLOOKUP(D144,Asiakkaat!$A$2:$E$244,3,FALSE),\"\")","v":""},{"$f":"IF(D144<>\"\",VLOOKUP(D144,Asiakkaat!$A$2:$E$100,4,FALSE),\"\")","v":""},{"$f":"IF(D144<>\"\",VLOOKUP(D144,Asiakkaat!$A$2:$E$394,5,FALSE)*2,\"\")","v":""},{"$f":"IF(D144<>\"\",H144*Parametrit!$B$6,\"\")","v":""},null,null,{"$f":"IF((J144*Parametrit!$B$4)+(K144*Parametrit!$B$5)=0,\"\",(J144*Parametrit!$B$4)+(K144*Parametrit!$B$5))","v":""},null,{"$f":"IF(A144<>\"\",I144+(J144*Parametrit!$B$4)+(K144*Parametrit!$B$5)+M144,\"\")","v":""}]
[null,"",{"$f":"IF(D145<>\"\",VLOOKUP(D145,Asiakkaat!$A$2:$E$244,2,FALSE),\"\")","v":""},null,null,{"$f":"IF(D145<>\"\",VLOOKUP(D145,Asiakkaat!$A$2:$E$244,3,FALSE),\"\")","v":""},{"$f":"IF(D145<>\"\",VLOOKUP(D145,Asiakkaat!$A$2:$E$100,4,FALSE),\"\")","v":""},{"$f":"IF(D145<>\"\",VLOOKUP(D145,Asiakkaat!$A$2:$E$394,5,FALSE)*2,\"\")","v":""},{"$f":"IF(D145<>\"\",H145*Parametrit!$B$6,\"\")","v":""},null,null,{"$f":"IF((J145*Parametrit!$B$4)+(K145*Parametrit!$B$5)=0,\"\",(J145*Parametrit!$B$4)+(K145*Parametrit!$B$5))","v":""},null,{"$f":"IF(A145<>\"\",I145+(J145*Parametrit!$B$4)+(K145*Parametrit!$B$5)+M145,\"\")","v":""}]
[null,"",{"$f":"IF(D146<>\"\",VLOOKUP(D146,Asiakkaat!$A$2:$E$244,2,FALSE),\"\")","v":""},null,null,{"$f":"IF(D146<>\"\",VLOOKUP(D146,Asiakkaat!$A$2:$E$244,3,FALSE),\"\")","v":""},{"$f":"IF(D146<>\"\",VLOOKUP(D146,Asiakkaat!$A$2:$E$100,4,FALSE),\"\")","v":""},{"$f":"IF(D146<>\"\",VLOOKUP(D146,Asiakkaat!$A$2:$E$394,5,FALSE)*2,\"\")","v":""},{"$f":"IF(D146<>\"\",H146*Parametrit!$B$6,\"\")","v":""},null,null,{"$f":"IF((J146*Parametrit!$B$4)+(K146*Parametrit!$B$5)=0,\"\",(J146*Parametrit!$B$4)+(K146*Parametrit!$B$5))","v":""},null,{"$f":"IF(A146<>\"\",I146+(J146*Parametrit!$B$4)+(K146*Parametrit!$B$5)+M146,\"\")","v":""}]
[null,"",{"$f":"IF(D147<>\"\",VLOOKUP(D147,Asiakkaat!$A$2:$E$244,2,FALSE),\"\")","v":""},null,null,{"$f":"IF(D147<>\"\",VLOOKUP(D147,Asiakkaat!$A$2:$E$244,3,FALSE),\"\")","v":""},{"$f":"IF(D147<>\"\",VLOOKUP(D147,Asiakkaat!$A$2:$E$100,4,FALSE),\"\")","v":""},{"$f":"IF(D147<>\"\",VLOOKUP(D147,Asiakkaat!$A$2:$E$394,5,FALSE)*2,\"\")","v":""},{"$f":"IF(D147<>\"\",H147*Parametrit!$B$6,\"\")","v":""},null,null,{"$f":"IF((J147*Parametrit!$B$4)+(K147*Parametrit!$B$5)=0,\"\",(J147*Parametrit!$B$4)+(K147*Parametrit!$B$5))","v":""},null,{"$f":"IF(A147<>\"\",I147+(J147*Parametrit!$B$4)+(K147*Parametrit!$B$5)+M147,\"\")","v":""}]
[null,"",{"$f":"IF(D148<>\"\",VLOOKUP(D148,Asiakkaat!$A$2:$E$244,2,FALSE),\"\")","v":""},null,null,{"$f":"IF(D148<>\"\",VLOOKUP(D148,Asiakkaat!$A$2:$E$244,3,FALSE),\"\")","v":""},{"$f":"IF(D148<>\"\",VLOOKUP(D148,Asiakkaat!$A$2:$E$100,4,FALSE),\"\")","v":""},{"$f":"IF(D148<>\"\",VLOOKUP(D148,Asiakkaat!$A$2:$E$394,5,FALSE)*2,\"\")","v":""},{"$f":"IF(D148<>\"\",H148*Parametrit!$B$6,\"\")","v":""},null,null,{"$f":"IF((J148*Parametrit!$B$4)+(K148*Parametrit!$B$5)=0,\"\",(J148*Parametrit!$B$4)+(K148*Parametrit!$B$5))","v":""},null,{"$f":"IF(A148<>\"\",I148+(J148*Parametrit!$B$4)+(K148*Parametrit!$B$5)+M148,\"\")","v":""}]
[null,"",{"$f":"IF(D149<>\"\",VLOOKUP(D149,Asiakkaat!$A$2:$E$244,2,FALSE),\"\")","v":""},null,null,{"$f":"IF(D149<>\"\",VLOOKUP(D149,Asiakkaat!$A$2:$E$244,3,FALSE),\"\")","v":""},{"$f":"IF(D149<>\"\",VLOOKUP(D149,Asiakkaat!$A$2:$E$100,4,FALSE),\"\")","v":""},{"$f":"IF(D149<>\"\",VLOOKUP(D149,Asiakkaat!$A$2:$E$394,5,FALSE)*2,\"\")","v":""},{"$f":"IF(D149<>\"\",H149*Parametrit!$B$6,\"\")","v":""},null,null,{"$f":"IF((J149*Parametrit!$B$4)+(K149*Parametrit!$B$5)=0,\"\",(J149*Parametrit!$B$4)+(K149*Parametrit!$B$5))","v":""},null,{"$f":"IF(A149<>\"\",I149+(J149*Parametrit!$B$4)+(K149*Parametrit!$B$5)+M149,\"\")","v":""}]
[null,"",{"$f":"IF(D150<>\"\",VLOOKUP(D150,Asiakkaat!$A$2:$E$244,2,FALSE),\"\")","v":""},null,null,{"$f":"IF(D150<>\"\",VLOOKUP(D150,Asiakkaat!$A$2:$E$244,3,FALSE),\"\")","v":""},{"$f":"IF(D150<>\"\",VLOOKUP(D150,Asiakkaat!$A$2:$E$100,4,FALSE),\"\")","v":""},{"$f":"IF(D150<>\"\",VLOOKUP(D150,Asiakkaat!$A$2:$E$394,5,FALSE)*2,\"\")","v":""},{"$f":"IF(D150<>\"\",H150*Parametrit!$B$6,\"\")","v":""},null,null,{"$f":"IF((J150*Parametrit!$B$4)+(K150*Parametrit!$B$5)=0,\"\",(J150*Parametrit!$B$4)+(K150*Parametrit!$B$5))","v":""},null,{"$f":"IF(A150<>\"\",I150+(J150*Parametrit!$B$4)+(K150*Parametrit!$B$5)+M150,\"\")","v":""}]
[null,"",{"$f":"IF(D151<>\"\",VLOOKUP(D151,Asiakkaat!$A$2:$E$244,2,FALSE),\"\")","v":""},null,null,{"$f":"IF(D151<>\"\",VLOOKUP(D151,Asiakkaat!$A$2:$E$244,3,FALSE),\"\")","v":""},{"$f":"IF(D151<>\"\",VLOOKUP(D151,Asiakkaat!$A$2:$E$100,4,FALSE),\"\")","v":""},{"$f":"IF(D151<>\"\",VLOOKUP(D151,Asiakkaat!$A$2:$E$394,5,FALSE)*2,\"\")","v":""},{"$f":"IF(D151<>\"\",H151*Parametrit!$B$6,\"\")","v":""},null,null,{"$f":"IF((J151*Parametrit!$B$4)+(K151*Parametrit!$B$5)=0,\"\",(J151*Parametrit!$B$4)+(K151*Parametrit!$B$5))","v":""},null,{"$f":"IF(A151<>\"\",I151+(J151*Parametrit!$B$4)+(K151*Parametrit!$B$5)+M151,\"\")","v":""}]
[null,"",{"$f":"IF(D152<>\"\",VLOOKUP(D152,Asiakkaat!$A$2:$E$244,2,FALSE),\"\")","v":""},null,null,{"$f":"IF(D152<>\"\",VLOOKUP(D152,Asiakkaat!$A$2:$E$244,3,FALSE),\"\")","v":""},{"$f":"IF(D152<>\"\",VLOOKUP(D152,Asiakkaat!$A$2:$E$100,4,FALSE),\"\")","v":""},{"$f":"IF(D152<>\"\",VLOOKUP(D152,Asiakkaat!$A$2:$E$394,5,FALSE)*2,\"\")","v":""},{"$f":"IF(D152<>\"\",H152*Parametrit!$B$6,\"\")","v":""},null,null,{"$f":"IF((J152*Parametrit!$B$4)+(K152*Parametrit!$B$5)=0,\"\",(J152*Parametrit!$B$4)+(K152*Parametrit!$B$5))","v":""},null,{"$f":"IF(A152<>\"\",I152+(J152*Parametrit!$B$4)+(K152*Parametrit!$B$5)+M152,\"\")","v":""}]
[null,"",{"$f":"IF(D153<>\"\",VLOOKUP(D153,Asiakkaat!$A$2:$E$244,2,FALSE),\"\")","v":""},null,null,{"$f":"IF(D153<>\"\",VLOOKUP(D153,Asiakkaat!$A$2:$E$244,3,FALSE),\"\")","v":""},{"$f":"IF(D153<>\"\",VLOOKUP(D153,Asiakkaat!$A$2:$E$100,4,FALSE),\"\")","v":""},{"$f":"IF(D153<>\"\",VLOOKUP(D153,Asiakkaat!$A$2:$E$394,5,FALSE)*2,\"\")","v":""},{"$f":"IF(D153<>\"\",H153*Parametrit!$B$6,\"\")","v":""},null,null,{"$f":"IF((J153*Parametrit!$B$4)+(K153*Parametrit!$B$5)=0,\"\",(J153*Parametrit!$B$4)+(K153*Parametrit!$B$5))","v":""},null,{"$f":"IF(A153<>\"\",I153+(J153*Parametrit!$B$4)+(K153*Parametrit!$B$5)+M153,\"\")","v":""}]
[]
[null,{"$f":"IF(A155<>\"\",WEEKDAY(A155),\"\")","v":""},null,null,null,{"$f":"IF(A155<>\"\",VLOOKUP(D155,Asiakkaat!$A$2:$E$244,2,FALSE),\"\")","v":""},null,"km","KM€","½pv","1pv","PV€","Muu€","YHT€"]
[null,{"$f":"IF(A156<>\"\",WEEKDAY(A156),\"\")","v":""},null,null,null,{"$f":"IF(A156<>\"\",VLOOKUP(D156,Asiakkaat!$A$2:$E$244,2,FALSE),\"\")","v":""},"Yht.",{"$f":"SUM(H3:H153)","v":774.92},{"$f":"SUM(I3:I153)","v":333.21559999999999},1,4,192,0,525.21559999999999]
[null,{"$f":"IF(A157<>\"\",WEEKDAY(A157),\"\")","v":""},null,null,null,null,null,null,{"$f":"IF(A157<>\"\",H157*#REF!,\"\")","v":""},null,null,null,null,{"$f":"IF(A157<>\"\",I157+(J157*16)+(K157*35),\"\")","v":""}]
[null,{"$f":"IF(A158<>\"\",WEEKDAY(A158),\"\")","v":""},null,null,null,null,null,null,{"$f":"IF(A158<>\"\",H158*#REF!,\"\")","v":""},null,null,null,null,{"$f":"IF(A158<>\"\",I158+(J158*16)+(K158*35),\"\")","v":""}]
[null,{"$f":"IF(A159<>\"\",WEEKDAY(A159),\"\")","v":""},null,null,null,null,null,null,{"$f":"IF(A159<>\"\",H159*#REF!,\"\")","v":""},null,null,null,null,{"$f":"IF(A159<>\"\",I159+(J159*16)+(K159*35),\"\")","v":""}]