{"text_format":"1","workbook":"xlsx","n_sheets":3,"sheets":["Parametrit","Asiakkaat","Matkalasku"],"not_rendered":{"charts":0,"images":0,"macros":0,"external_links":0,"defined_names":0,"comments":1,"pivot_tables":0},"unopened":[],"bounds":{"document_bytes":16777216,"sheet_cells":100000,"rows_first":2000,"rows_last":500,"rows_between":2000,"halvings":0,"cell_chars":16384,"cell_head_chars":4096},"cells_cut":0,"cells_raw":0,"read":"whole","date_system":"1900"}

{"sheet":"Parametrit","index":0,"n_rows":6,"n_cols":2,"rows_kept":6,"cut":false,"hidden":false,"merged":[]}
["Parametrit"]
["Lähtöosoite","Liikekatu 24"]
["Lähtöpaikka","TURKU"]
["½-Päiväraha",20]
["1-Päiväraha",43]
["Km-Raha",0.43]

{"sheet":"Asiakkaat","index":1,"n_rows":5,"n_cols":5,"rows_kept":5,"cut":false,"hidden":false,"merged":[]}
["Kohde","Lähtöpaikka","Osoite","Paikka","Km"]
["Firma Oy","Liikekatu 24","Firmatie 24","TURKU",1.6]
["Kauppa Oy","Liikekatu 24","Kauppakatu 61","TURKU",12.45]
["Tehdas Oy","Liikekatu 24","Tehdaskatu 34","TURKU",14.29]
["Yhtiö Oy","Liikekatu 24","Yhtiönkatu 6","HELSINKI",165.39]

{"sheet":"Matkalasku","index":2,"n_rows":159,"n_cols":14,"rows_kept":159,"cut":false,"hidden":false,"merged":[]}
[null,null,null,null,"Kilometrikorvaukset ja päivärahat"]
["Pvm","Vkpv","Lähtö","Kohde","Selite","Osoite","Paikka","Km","Km€","½pv","1pv","Pv€","Muu€","Summa"]
["2014-01-07",{"$f":"IF(A3<>\"\",IFERROR(WEEKDAY(A3),\"\"),\"\")","v":"1900-01-03"},{"$f":"IF(D3<>\"\",VLOOKUP(D3,Asiakkaat!$A$2:$E$244,2,FALSE),\"\")","v":"Liikekatu 24"},"Firma Oy",null,{"$f":"IF(D3<>\"\",VLOOKUP(D3,Asiakkaat!$A$2:$E$244,3,FALSE),\"\")","v":"Firmatie 24"},{"$f":"IF(D3<>\"\",VLOOKUP(D3,Asiakkaat!$A$2:$E$100,4,FALSE),\"\")","v":"TURKU"},{"$f":"IF(D3<>\"\",VLOOKUP(D3,Asiakkaat!$A$2:$E$394,5,FALSE)*2,\"\")","v":3.2},{"$f":"IF(D3<>\"\",H3*Parametrit!$B$6,\"\")","v":1.3760000000000001},null,null,{"$f":"IF((J3*Parametrit!$B$4)+(K3*Parametrit!$B$5)=0,\"\",(J3*Parametrit!$B$4)+(K3*Parametrit!$B$5))","v":""},null,{"$f":"IF(A3<>\"\",I3+(J3*Parametrit!$B$4)+(K3*Parametrit!$B$5)+M3,\"\")","v":1.3760000000000001}]
["2014-01-14","1900-01-03",{"$f":"IF(D4<>\"\",VLOOKUP(D4,Asiakkaat!$A$2:$E$244,2,FALSE),\"\")","v":"Liikekatu 24"},"Kauppa Oy",null,{"$f":"IF(D4<>\"\",VLOOKUP(D4,Asiakkaat!$A$2:$E$244,3,FALSE),\"\")","v":"Kauppakatu 61"},{"$f":"IF(D4<>\"\",VLOOKUP(D4,Asiakkaat!$A$2:$E$100,4,FALSE),\"\")","v":"TURKU"},{"$f":"IF(D4<>\"\",VLOOKUP(D4,Asiakkaat!$A$2:$E$394,5,FALSE)*2,\"\")","v":24.9},{"$f":"IF(D4<>\"\",H4*Parametrit!$B$6,\"\")","v":10.706999999999999},1,null,{"$f":"IF((J4*Parametrit!$B$4)+(K4*Parametrit!$B$5)=0,\"\",(J4*Parametrit!$B$4)+(K4*Parametrit!$B$5))","v":20},null,{"$f":"IF(A4<>\"\",I4+(J4*Parametrit!$B$4)+(K4*Parametrit!$B$5)+M4,\"\")","v":30.707000000000001}]
["2014-01-15","1900-01-04",{"$f":"IF(D5<>\"\",VLOOKUP(D5,Asiakkaat!$A$2:$E$244,2,FALSE),\"\")","v":"Liikekatu 24"},"Tehdas Oy",null,{"$f":"IF(D5<>\"\",VLOOKUP(D5,Asiakkaat!$A$2:$E$244,3,FALSE),\"\")","v":"Tehdaskatu 34"},{"$f":"IF(D5<>\"\",VLOOKUP(D5,Asiakkaat!$A$2:$E$100,4,FALSE),\"\")","v":"TURKU"},{"$f":"IF(D5<>\"\",VLOOKUP(D5,Asiakkaat!$A$2:$E$394,5,FALSE)*2,\"\")","v":28.58},{"$f":"IF(D5<>\"\",H5*Parametrit!$B$6,\"\")","v":12.289399999999999},null,null,{"$f":"IF((J5*Parametrit!$B$4)+(K5*Parametrit!$B$5)=0,\"\",(J5*Parametrit!$B$4)+(K5*Parametrit!$B$5))","v":""},null,{"$f":"IF(A5<>\"\",I5+(J5*Parametrit!$B$4)+(K5*Parametrit!$B$5)+M5,\"\")","v":12.289399999999999}]
["2014-01-15","1900-01-04",{"$f":"IF(D6<>\"\",VLOOKUP(D6,Asiakkaat!$A$2:$E$244,2,FALSE),\"\")","v":"Liikekatu 24"},"Yhtiö Oy",null,{"$f":"IF(D6<>\"\",VLOOKUP(D6,Asiakkaat!$A$2:$E$244,3,FALSE),\"\")","v":"Yhtiönkatu 6"},{"$f":"IF(D6<>\"\",VLOOKUP(D6,Asiakkaat!$A$2:$E$100,4,FALSE),\"\")","v":"HELSINKI"},{"$f":"IF(D6<>\"\",VLOOKUP(D6,Asiakkaat!$A$2:$E$394,5,FALSE)*2,\"\")","v":330.78},{"$f":"IF(D6<>\"\",H6*Parametrit!$B$6,\"\")","v":142.2354},null,2,{"$f":"IF((J6*Parametrit!$B$4)+(K6*Parametrit!$B$5)=0,\"\",(J6*Parametrit!$B$4)+(K6*Parametrit!$B$5))","v":86},null,{"$f":"IF(A6<>\"\",I6+(J6*Parametrit!$B$4)+(K6*Parametrit!$B$5)+M6,\"\")","v":228.2354}]
["2014-01-17","1900-01-06",{"$f":"IF(D7<>\"\",VLOOKUP(D7,Asiakkaat!$A$2:$E$244,2,FALSE),\"\")","v":"Liikekatu 24"},"Kauppa Oy",null,{"$f":"IF(D7<>\"\",VLOOKUP(D7,Asiakkaat!$A$2:$E$244,3,FALSE),\"\")","v":"Kauppakatu 61"},{"$f":"IF(D7<>\"\",VLOOKUP(D7,Asiakkaat!$A$2:$E$100,4,FALSE),\"\")","v":"TURKU"},{"$f":"IF(D7<>\"\",VLOOKUP(D7,Asiakkaat!$A$2:$E$394,5,FALSE)*2,\"\")","v":24.9},{"$f":"IF(D7<>\"\",H7*Parametrit!$B$6,\"\")","v":10.706999999999999},null,null,{"$f":"IF((J7*Parametrit!$B$4)+(K7*Parametrit!$B$5)=0,\"\",(J7*Parametrit!$B$4)+(K7*Parametrit!$B$5))","v":""},null,{"$f":"IF(A7<>\"\",I7+(J7*Parametrit!$B$4)+(K7*Parametrit!$B$5)+M7,\"\")","v":10.706999999999999}]
["2014-01-17","1900-01-06",{"$f":"IF(D8<>\"\",VLOOKUP(D8,Asiakkaat!$A$2:$E$244,2,FALSE),\"\")","v":"Liikekatu 24"},"Firma Oy",null,{"$f":"IF(D8<>\"\",VLOOKUP(D8,Asiakkaat!$A$2:$E$244,3,FALSE),\"\")","v":"Firmatie 24"},{"$f":"IF(D8<>\"\",VLOOKUP(D8,Asiakkaat!$A$2:$E$100,4,FALSE),\"\")","v":"TURKU"},{"$f":"IF(D8<>\"\",VLOOKUP(D8,Asiakkaat!$A$2:$E$394,5,FALSE)*2,\"\")","v":3.2},{"$f":"IF(D8<>\"\",H8*Parametrit!$B$6,\"\")","v":1.3760000000000001},null,null,{"$f":"IF((J8*Parametrit!$B$4)+(K8*Parametrit!$B$5)=0,\"\",(J8*Parametrit!$B$4)+(K8*Parametrit!$B$5))","v":""},null,{"$f":"IF(A8<>\"\",I8+(J8*Parametrit!$B$4)+(K8*Parametrit!$B$5)+M8,\"\")","v":1.3760000000000001}]
["2014-01-17","1900-01-06",{"$f":"IF(D9<>\"\",VLOOKUP(D9,Asiakkaat!$A$2:$E$244,2,FALSE),\"\")","v":"Liikekatu 24"},"Yhtiö Oy",null,{"$f":"IF(D9<>\"\",VLOOKUP(D9,Asiakkaat!$A$2:$E$244,3,FALSE),\"\")","v":"Yhtiönkatu 6"},{"$f":"IF(D9<>\"\",VLOOKUP(D9,Asiakkaat!$A$2:$E$100,4,FALSE),\"\")","v":"HELSINKI"},{"$f":"IF(D9<>\"\",VLOOKUP(D9,Asiakkaat!$A$2:$E$394,5,FALSE)*2,\"\")","v":330.78},{"$f":"IF(D9<>\"\",H9*Parametrit!$B$6,\"\")","v":142.2354},null,2,{"$f":"IF((J9*Parametrit!$B$4)+(K9*Parametrit!$B$5)=0,\"\",(J9*Parametrit!$B$4)+(K9*Parametrit!$B$5))","v":86},null,{"$f":"IF(A9<>\"\",I9+(J9*Parametrit!$B$4)+(K9*Parametrit!$B$5)+M9,\"\")","v":228.2354}]
["2014-01-21","1900-01-03",{"$f":"IF(D10<>\"\",VLOOKUP(D10,Asiakkaat!$A$2:$E$244,2,FALSE),\"\")","v":"Liikekatu 24"},"Tehdas Oy",null,{"$f":"IF(D10<>\"\",VLOOKUP(D10,Asiakkaat!$A$2:$E$244,3,FALSE),\"\")","v":"Tehdaskatu 34"},{"$f":"IF(D10<>\"\",VLOOKUP(D10,Asiakkaat!$A$2:$E$100,4,FALSE),\"\")","v":"TURKU"},{"$f":"IF(D10<>\"\",VLOOKUP(D10,Asiakkaat!$A$2:$E$394,5,FALSE)*2,\"\")","v":28.58},{"$f":"IF(D10<>\"\",H10*Parametrit!$B$6,\"\")","v":12.289399999999999},null,null,{"$f":"IF((J10*Parametrit!$B$4)+(K10*Parametrit!$B$5)=0,\"\",(J10*Parametrit!$B$4)+(K10*Parametrit!$B$5))","v":""},null,{"$f":"IF(A10<>\"\",I10+(J10*Parametrit!$B$4)+(K10*Parametrit!$B$5)+M10,\"\")","v":12.289399999999999}]
[null,"",{"$f":"IF(D11<>\"\",VLOOKUP(D11,Asiakkaat!$A$2:$E$244,2,FALSE),\"\")","v":""},null,null,{"$f":"IF(D11<>\"\",VLOOKUP(D11,Asiakkaat!$A$2:$E$244,3,FALSE),\"\")","v":""},{"$f":"IF(D11<>\"\",VLOOKUP(D11,Asiakkaat!$A$2:$E$100,4,FALSE),\"\")","v":""},{"$f":"IF(D11<>\"\",VLOOKUP(D11,Asiakkaat!$A$2:$E$394,5,FALSE)*2,\"\")","v":""},{"$f":"IF(D11<>\"\",H11*Parametrit!$B$6,\"\")","v":""},null,null,{"$f":"IF((J11*Parametrit!$B$4)+(K11*Parametrit!$B$5)=0,\"\",(J11*Parametrit!$B$4)+(K11*Parametrit!$B$5))","v":""},null,{"$f":"IF(A11<>\"\",I11+(J11*Parametrit!$B$4)+(K11*Parametrit!$B$5)+M11,\"\")","v":""}]
[null,"",{"$f":"IF(D12<>\"\",VLOOKUP(D12,Asiakkaat!$A$2:$E$244,2,FALSE),\"\")","v":""},null,null,{"$f":"IF(D12<>\"\",VLOOKUP(D12,Asiakkaat!$A$2:$E$244,3,FALSE),\"\")","v":""},{"$f":"IF(D12<>\"\",VLOOKUP(D12,Asiakkaat!$A$2:$E$100,4,FALSE),\"\")","v":""},{"$f":"IF(D12<>\"\",VLOOKUP(D12,Asiakkaat!$A$2:$E$394,5,FALSE)*2,\"\")","v":""},{"$f":"IF(D12<>\"\",H12*Parametrit!$B$6,\"\")","v":""},null,null,{"$f":"IF((J12*Parametrit!$B$4)+(K12*Parametrit!$B$5)=0,\"\",(J12*Parametrit!$B$4)+(K12*Parametrit!$B$5))","v":""},null,{"$f":"IF(A12<>\"\",I12+(J12*Parametrit!$B$4)+(K12*Parametrit!$B$5)+M12,\"\")","v":""}]
[null,"",{"$f":"IF(D13<>\"\",VLOOKUP(D13,Asiakkaat!$A$2:$E$244,2,FALSE),\"\")","v":""},null,null,{"$f":"IF(D13<>\"\",VLOOKUP(D13,Asiakkaat!$A$2:$E$244,3,FALSE),\"\")","v":""},{"$f":"IF(D13<>\"\",VLOOKUP(D13,Asiakkaat!$A$2:$E$100,4,FALSE),\"\")","v":""},{"$f":"IF(D13<>\"\",VLOOKUP(D13,Asiakkaat!$A$2:$E$394,5,FALSE)*2,\"\")","v":""},{"$f":"IF(H13<>\"\",H13*Parametrit!$B$6,\"\")","v":""},null,null,{"$f":"IF((J13*Parametrit!$B$4)+(K13*Parametrit!$B$5)=0,\"\",(J13*Parametrit!$B$4)+(K13*Parametrit!$B$5))","v":""},null,{"$f":"IF(A13<>\"\",I13+(J13*Parametrit!$B$4)+(K13*Parametrit!$B$5)+M13,\"\")","v":""}]
[null,"",{"$f":"IF(D14<>\"\",VLOOKUP(D14,Asiakkaat!$A$2:$E$244,2,FALSE),\"\")","v":""},null,null,{"$f":"IF(D14<>\"\",VLOOKUP(D14,Asiakkaat!$A$2:$E$244,3,FALSE),\"\")","v":""},{"$f":"IF(D14<>\"\",VLOOKUP(D14,Asiakkaat!$A$2:$E$100,4,FALSE),\"\")","v":""},{"$f":"IF(D14<>\"\",VLOOKUP(D14,Asiakkaat!$A$2:$E$394,5,FALSE)*2,\"\")","v":""},{"$f":"IF(D14<>\"\",H14*Parametrit!$B$6,\"\")","v":""},null,null,{"$f":"IF((J14*Parametrit!$B$4)+(K14*Parametrit!$B$5)=0,\"\",(J14*Parametrit!$B$4)+(K14*Parametrit!$B$5))","v":""},null,{"$f":"IF(A14<>\"\",I14+(J14*Parametrit!$B$4)+(K14*Parametrit!$B$5)+M14,\"\")","v":""}]
[null,"",{"$f":"IF(D15<>\"\",VLOOKUP(D15,Asiakkaat!$A$2:$E$244,2,FALSE),\"\")","v":""},null,null,{"$f":"IF(D15<>\"\",VLOOKUP(D15,Asiakkaat!$A$2:$E$244,3,FALSE),\"\")","v":""},{"$f":"IF(D15<>\"\",VLOOKUP(D15,Asiakkaat!$A$2:$E$100,4,FALSE),\"\")","v":""},{"$f":"IF(D15<>\"\",VLOOKUP(D15,Asiakkaat!$A$2:$E$394,5,FALSE)*2,\"\")","v":""},{"$f":"IF(D15<>\"\",H15*Parametrit!$B$6,\"\")","v":""},null,null,{"$f":"IF((J15*Parametrit!$B$4)+(K15*Parametrit!$B$5)=0,\"\",(J15*Parametrit!$B$4)+(K15*Parametrit!$B$5))","v":""},null,{"$f":"IF(A15<>\"\",I15+(J15*Parametrit!$B$4)+(K15*Parametrit!$B$5)+M15,\"\")","v":""}]
[null,"",{"$f":"IF(D16<>\"\",VLOOKUP(D16,Asiakkaat!$A$2:$E$244,2,FALSE),\"\")","v":""},null,null,{"$f":"IF(D16<>\"\",VLOOKUP(D16,Asiakkaat!$A$2:$E$244,3,FALSE),\"\")","v":""},{"$f":"IF(D16<>\"\",VLOOKUP(D16,Asiakkaat!$A$2:$E$100,4,FALSE),\"\")","v":""},{"$f":"IF(D16<>\"\",VLOOKUP(D16,Asiakkaat!$A$2:$E$394,5,FALSE)*2,\"\")","v":""},{"$f":"IFERROR(H16*Parametrit!$B$6,\"\")","v":""},null,null,{"$f":"IF((J16*Parametrit!$B$4)+(K16*Parametrit!$B$5)=0,\"\",(J16*Parametrit!$B$4)+(K16*Parametrit!$B$5))","v":""},null,{"$f":"IF(A16<>\"\",I16+(J16*Parametrit!$B$4)+(K16*Parametrit!$B$5)+M16,\"\")","v":""}]
[null,"",{"$f":"IF(D17<>\"\",VLOOKUP(D17,Asiakkaat!$A$2:$E$244,2,FALSE),\"\")","v":""},null,null,{"$f":"IF(D17<>\"\",VLOOKUP(D17,Asiakkaat!$A$2:$E$244,3,FALSE),\"\")","v":""},{"$f":"IF(D17<>\"\",VLOOKUP(D17,Asiakkaat!$A$2:$E$100,4,FALSE),\"\")","v":""},{"$f":"IF(D17<>\"\",VLOOKUP(D17,Asiakkaat!$A$2:$E$394,5,FALSE)*2,\"\")","v":""},{"$f":"IF(D17<>\"\",H17*Parametrit!$B$6,\"\")","v":""},null,null,{"$f":"IF((J17*Parametrit!$B$4)+(K17*Parametrit!$B$5)=0,\"\",(J17*Parametrit!$B$4)+(K17*Parametrit!$B$5))","v":""},null,{"$f":"IF(A17<>\"\",I17+(J17*Parametrit!$B$4)+(K17*Parametrit!$B$5)+M17,\"\")","v":""}]
[null,"",{"$f":"IF(D18<>\"\",VLOOKUP(D18,Asiakkaat!$A$2:$E$244,2,FALSE),\"\")","v":""},null,null,{"$f":"IF(D18<>\"\",VLOOKUP(D18,Asiakkaat!$A$2:$E$244,3,FALSE),\"\")","v":""},{"$f":"IF(D18<>\"\",VLOOKUP(D18,Asiakkaat!$A$2:$E$100,4,FALSE),\"\")","v":""},{"$f":"IF(D18<>\"\",VLOOKUP(D18,Asiakkaat!$A$2:$E$394,5,FALSE)*2,\"\")","v":""},{"$f":"IF(D18<>\"\",H18*Parametrit!$B$6,\"\")","v":""},null,null,{"$f":"IF((J18*Parametrit!$B$4)+(K18*Parametrit!$B$5)=0,\"\",(J18*Parametrit!$B$4)+(K18*Parametrit!$B$5))","v":""},null,{"$f":"IF(A18<>\"\",I18+(J18*Parametrit!$B$4)+(K18*Parametrit!$B$5)+M18,\"\")","v":""}]
[null,"",{"$f":"IF(D19<>\"\",VLOOKUP(D19,Asiakkaat!$A$2:$E$244,2,FALSE),\"\")","v":""},null,null,{"$f":"IF(D19<>\"\",VLOOKUP(D19,Asiakkaat!$A$2:$E$244,3,FALSE),\"\")","v":""},{"$f":"IF(D19<>\"\",VLOOKUP(D19,Asiakkaat!$A$2:$E$100,4,FALSE),\"\")","v":""},{"$f":"IF(D19<>\"\",VLOOKUP(D19,Asiakkaat!$A$2:$E$394,5,FALSE)*2,\"\")","v":""},{"$f":"IF(D19<>\"\",H19*Parametrit!$B$6,\"\")","v":""},null,null,{"$f":"IF((J19*Parametrit!$B$4)+(K19*Parametrit!$B$5)=0,\"\",(J19*Parametrit!$B$4)+(K19*Parametrit!$B$5))","v":""},null,{"$f":"IF(A19<>\"\",I19+(J19*Parametrit!$B$4)+(K19*Parametrit!$B$5)+M19,\"\")","v":""}]
[null,"",{"$f":"IF(D20<>\"\",VLOOKUP(D20,Asiakkaat!$A$2:$E$244,2,FALSE),\"\")","v":""},null,null,{"$f":"IF(D20<>\"\",VLOOKUP(D20,Asiakkaat!$A$2:$E$244,3,FALSE),\"\")","v":""},{"$f":"IF(D20<>\"\",VLOOKUP(D20,Asiakkaat!$A$2:$E$100,4,FALSE),\"\")","v":""},{"$f":"IF(D20<>\"\",VLOOKUP(D20,Asiakkaat!$A$2:$E$394,5,FALSE)*2,\"\")","v":""},{"$f":"IF(D20<>\"\",H20*Parametrit!$B$6,\"\")","v":""},null,null,{"$f":"IF((J20*Parametrit!$B$4)+(K20*Parametrit!$B$5)=0,\"\",(J20*Parametrit!$B$4)+(K20*Parametrit!$B$5))","v":""},null,{"$f":"IF(A20<>\"\",I20+(J20*Parametrit!$B$4)+(K20*Parametrit!$B$5)+M20,\"\")","v":""}]
[null,"",{"$f":"IF(D21<>\"\",VLOOKUP(D21,Asiakkaat!$A$2:$E$244,2,FALSE),\"\")","v":""},null,null,{"$f":"IF(D21<>\"\",VLOOKUP(D21,Asiakkaat!$A$2:$E$244,3,FALSE),\"\")","v":""},{"$f":"IF(D21<>\"\",VLOOKUP(D21,Asiakkaat!$A$2:$E$100,4,FALSE),\"\")","v":""},{"$f":"IF(D21<>\"\",VLOOKUP(D21,Asiakkaat!$A$2:$E$394,5,FALSE)*2,\"\")","v":""},{"$f":"IF(D21<>\"\",H21*Parametrit!$B$6,\"\")","v":""},null,null,{"$f":"IF((J21*Parametrit!$B$4)+(K21*Parametrit!$B$5)=0,\"\",(J21*Parametrit!$B$4)+(K21*Parametrit!$B$5))","v":""},null,{"$f":"IF(A21<>\"\",I21+(J21*Parametrit!$B$4)+(K21*Parametrit!$B$5)+M21,\"\")","v":""}]
[null,"",{"$f":"IF(D22<>\"\",VLOOKUP(D22,Asiakkaat!$A$2:$E$244,2,FALSE),\"\")","v":""},null,null,{"$f":"IF(D22<>\"\",VLOOKUP(D22,Asiakkaat!$A$2:$E$244,3,FALSE),\"\")","v":""},{"$f":"IF(D22<>\"\",VLOOKUP(D22,Asiakkaat!$A$2:$E$100,4,FALSE),\"\")","v":""},{"$f":"IF(D22<>\"\",VLOOKUP(D22,Asiakkaat!$A$2:$E$394,5,FALSE)*2,\"\")","v":""},{"$f":"IF(D22<>\"\",H22*Parametrit!$B$6,\"\")","v":""},null,null,{"$f":"IF((J22*Parametrit!$B$4)+(K22*Parametrit!$B$5)=0,\"\",(J22*Parametrit!$B$4)+(K22*Parametrit!$B$5))","v":""},null,{"$f":"IF(A22<>\"\",I22+(J22*Parametrit!$B$4)+(K22*Parametrit!$B$5)+M22,\"\")","v":""}]
[null,{"$f":"IF(A23<>\"\",IFERROR(WEEKDAY(A23),\"\"),\"\")","v":""},{"$f":"IF(D23<>\"\",VLOOKUP(D23,Asiakkaat!$A$2:$E$244,2,FALSE),\"\")","v":""},null,null,{"$f":"IF(D23<>\"\",VLOOKUP(D23,Asiakkaat!$A$2:$E$244,3,FALSE),\"\")","v":""},{"$f":"IF(D23<>\"\",VLOOKUP(D23,Asiakkaat!$A$2:$E$100,4,FALSE),\"\")","v":""},{"$f":"IF(D23<>\"\",VLOOKUP(D23,Asiakkaat!$A$2:$E$394,5,FALSE)*2,\"\")","v":""},{"$f":"IF(D23<>\"\",H23*Parametrit!$B$6,\"\")","v":""},null,null,{"$f":"IF((J23*Parametrit!$B$4)+(K23*Parametrit!$B$5)=0,\"\",(J23*Parametrit!$B$4)+(K23*Parametrit!$B$5))","v":""},null,{"$f":"IF(A23<>\"\",I23+(J23*Parametrit!$B$4)+(K23*Parametrit!$B$5)+M23,\"\")","v":""}]
[null,"",{"$f":"IF(D24<>\"\",VLOOKUP(D24,Asiakkaat!$A$2:$E$244,2,FALSE),\"\")","v":""},null,null,{"$f":"IF(D24<>\"\",VLOOKUP(D24,Asiakkaat!$A$2:$E$244,3,FALSE),\"\")","v":""},{"$f":"IF(D24<>\"\",VLOOKUP(D24,Asiakkaat!$A$2:$E$100,4,FALSE),\"\")","v":""},{"$f":"IF(D24<>\"\",VLOOKUP(D24,Asiakkaat!$A$2:$E$394,5,FALSE)*2,\"\")","v":""},{"$f":"IF(D24<>\"\",H24*Parametrit!$B$6,\"\")","v":""},null,null,{"$f":"IF((J24*Parametrit!$B$4)+(K24*Parametrit!$B$5)=0,\"\",(J24*Parametrit!$B$4)+(K24*Parametrit!$B$5))","v":""},null,{"$f":"IF(A24<>\"\",I24+(J24*Parametrit!$B$4)+(K24*Parametrit!$B$5)+M24,\"\")","v":""}]
[null,"",{"$f":"IF(D25<>\"\",VLOOKUP(D25,Asiakkaat!$A$2:$E$244,2,FALSE),\"\")","v":""},null,null,{"$f":"IF(D25<>\"\",VLOOKUP(D25,Asiakkaat!$A$2:$E$244,3,FALSE),\"\")","v":""},{"$f":"IF(D25<>\"\",VLOOKUP(D25,Asiakkaat!$A$2:$E$100,4,FALSE),\"\")","v":""},{"$f":"IF(D25<>\"\",VLOOKUP(D25,Asiakkaat!$A$2:$E$394,5,FALSE)*2,\"\")","v":""},{"$f":"IF(D25<>\"\",H25*Parametrit!$B$6,\"\")","v":""},null,null,{"$f":"IF((J25*Parametrit!$B$4)+(K25*Parametrit!$B$5)=0,\"\",(J25*Parametrit!$B$4)+(K25*Parametrit!$B$5))","v":""},null,{"$f":"IF(A25<>\"\",I25+(J25*Parametrit!$B$4)+(K25*Parametrit!$B$5)+M25,\"\")","v":""}]
[null,"",{"$f":"IF(D26<>\"\",VLOOKUP(D26,Asiakkaat!$A$2:$E$244,2,FALSE),\"\")","v":""},null,null,{"$f":"IF(D26<>\"\",VLOOKUP(D26,Asiakkaat!$A$2:$E$244,3,FALSE),\"\")","v":""},{"$f":"IF(D26<>\"\",VLOOKUP(D26,Asiakkaat!$A$2:$E$100,4,FALSE),\"\")","v":""},{"$f":"IF(D26<>\"\",VLOOKUP(D26,Asiakkaat!$A$2:$E$394,5,FALSE)*2,\"\")","v":""},{"$f":"IF(D26<>\"\",H26*Parametrit!$B$6,\"\")","v":""},null,null,{"$f":"IF((J26*Parametrit!$B$4)+(K26*Parametrit!$B$5)=0,\"\",(J26*Parametrit!$B$4)+(K26*Parametrit!$B$5))","v":""},null,{"$f":"IF(A26<>\"\",I26+(J26*Parametrit!$B$4)+(K26*Parametrit!$B$5)+M26,\"\")","v":""}]
[null,"",{"$f":"IF(D27<>\"\",VLOOKUP(D27,Asiakkaat!$A$2:$E$244,2,FALSE),\"\")","v":""},null,null,{"$f":"IF(D27<>\"\",VLOOKUP(D27,Asiakkaat!$A$2:$E$244,3,FALSE),\"\")","v":""},{"$f":"IF(D27<>\"\",VLOOKUP(D27,Asiakkaat!$A$2:$E$100,4,FALSE),\"\")","v":""},{"$f":"IF(D27<>\"\",VLOOKUP(D27,Asiakkaat!$A$2:$E$394,5,FALSE)*2,\"\")","v":""},{"$f":"IF(D27<>\"\",H27*Parametrit!$B$6,\"\")","v":""},null,null,{"$f":"IF((J27*Parametrit!$B$4)+(K27*Parametrit!$B$5)=0,\"\",(J27*Parametrit!$B$4)+(K27*Parametrit!$B$5))","v":""},null,{"$f":"IF(A27<>\"\",I27+(J27*Parametrit!$B$4)+(K27*Parametrit!$B$5)+M27,\"\")","v":""}]
[null,"",{"$f":"IF(D28<>\"\",VLOOKUP(D28,Asiakkaat!$A$2:$E$244,2,FALSE),\"\")","v":""},null,null,{"$f":"IF(D28<>\"\",VLOOKUP(D28,Asiakkaat!$A$2:$E$244,3,FALSE),\"\")","v":""},{"$f":"IF(D28<>\"\",VLOOKUP(D28,Asiakkaat!$A$2:$E$100,4,FALSE),\"\")","v":""},{"$f":"IF(D28<>\"\",VLOOKUP(D28,Asiakkaat!$A$2:$E$394,5,FALSE)*2,\"\")","v":""},{"$f":"IF(D28<>\"\",H28*Parametrit!$B$6,\"\")","v":""},null,null,{"$f":"IF((J28*Parametrit!$B$4)+(K28*Parametrit!$B$5)=0,\"\",(J28*Parametrit!$B$4)+(K28*Parametrit!$B$5))","v":""},null,{"$f":"IF(A28<>\"\",I28+(J28*Parametrit!$B$4)+(K28*Parametrit!$B$5)+M28,\"\")","v":""}]
[null,"",{"$f":"IF(D29<>\"\",VLOOKUP(D29,Asiakkaat!$A$2:$E$244,2,FALSE),\"\")","v":""},null,null,{"$f":"IF(D29<>\"\",VLOOKUP(D29,Asiakkaat!$A$2:$E$244,3,FALSE),\"\")","v":""},{"$f":"IF(D29<>\"\",VLOOKUP(D29,Asiakkaat!$A$2:$E$100,4,FALSE),\"\")","v":""},{"$f":"IF(D29<>\"\",VLOOKUP(D29,Asiakkaat!$A$2:$E$394,5,FALSE)*2,\"\")","v":""},{"$f":"IF(D29<>\"\",H29*Parametrit!$B$6,\"\")","v":""},null,null,{"$f":"IF((J29*Parametrit!$B$4)+(K29*Parametrit!$B$5)=0,\"\",(J29*Parametrit!$B$4)+(K29*Parametrit!$B$5))","v":""},null,{"$f":"IF(A29<>\"\",I29+(J29*Parametrit!$B$4)+(K29*Parametrit!$B$5)+M29,\"\")","v":""}]
[null,"",{"$f":"IF(D30<>\"\",VLOOKUP(D30,Asiakkaat!$A$2:$E$244,2,FALSE),\"\")","v":""},null,null,{"$f":"IF(D30<>\"\",VLOOKUP(D30,Asiakkaat!$A$2:$E$244,3,FALSE),\"\")","v":""},{"$f":"IF(D30<>\"\",VLOOKUP(D30,Asiakkaat!$A$2:$E$100,4,FALSE),\"\")","v":""},{"$f":"IF(D30<>\"\",VLOOKUP(D30,Asiakkaat!$A$2:$E$394,5,FALSE)*2,\"\")","v":""},{"$f":"IF(D30<>\"\",H30*Parametrit!$B$6,\"\")","v":""},null,null,{"$f":"IF((J30*Parametrit!$B$4)+(K30*Parametrit!$B$5)=0,\"\",(J30*Parametrit!$B$4)+(K30*Parametrit!$B$5))","v":""},null,{"$f":"IF(A30<>\"\",I30+(J30*Parametrit!$B$4)+(K30*Parametrit!$B$5)+M30,\"\")","v":""}]
[null,"",{"$f":"IF(D31<>\"\",VLOOKUP(D31,Asiakkaat!$A$2:$E$244,2,FALSE),\"\")","v":""},null,null,{"$f":"IF(D31<>\"\",VLOOKUP(D31,Asiakkaat!$A$2:$E$244,3,FALSE),\"\")","v":""},{"$f":"IF(D31<>\"\",VLOOKUP(D31,Asiakkaat!$A$2:$E$100,4,FALSE),\"\")","v":""},{"$f":"IF(D31<>\"\",VLOOKUP(D31,Asiakkaat!$A$2:$E$394,5,FALSE)*2,\"\")","v":""},{"$f":"IF(D31<>\"\",H31*Parametrit!$B$6,\"\")","v":""},null,null,{"$f":"IF((J31*Parametrit!$B$4)+(K31*Parametrit!$B$5)=0,\"\",(J31*Parametrit!$B$4)+(K31*Parametrit!$B$5))","v":""},null,{"$f":"IF(A31<>\"\",I31+(J31*Parametrit!$B$4)+(K31*Parametrit!$B$5)+M31,\"\")","v":""}]
[null,"",{"$f":"IF(D32<>\"\",VLOOKUP(D32,Asiakkaat!$A$2:$E$244,2,FALSE),\"\")","v":""},null,null,{"$f":"IF(D32<>\"\",VLOOKUP(D32,Asiakkaat!$A$2:$E$244,3,FALSE),\"\")","v":""},{"$f":"IF(D32<>\"\",VLOOKUP(D32,Asiakkaat!$A$2:$E$100,4,FALSE),\"\")","v":""},{"$f":"IF(D32<>\"\",VLOOKUP(D32,Asiakkaat!$A$2:$E$394,5,FALSE)*2,\"\")","v":""},{"$f":"IF(D32<>\"\",H32*Parametrit!$B$6,\"\")","v":""},null,null,{"$f":"IF((J32*Parametrit!$B$4)+(K32*Parametrit!$B$5)=0,\"\",(J32*Parametrit!$B$4)+(K32*Parametrit!$B$5))","v":""},null,{"$f":"IF(A32<>\"\",I32+(J32*Parametrit!$B$4)+(K32*Parametrit!$B$5)+M32,\"\")","v":""}]
[null,"",{"$f":"IF(D33<>\"\",VLOOKUP(D33,Asiakkaat!$A$2:$E$244,2,FALSE),\"\")","v":""},null,null,{"$f":"IF(D33<>\"\",VLOOKUP(D33,Asiakkaat!$A$2:$E$244,3,FALSE),\"\")","v":""},{"$f":"IF(D33<>\"\",VLOOKUP(D33,Asiakkaat!$A$2:$E$100,4,FALSE),\"\")","v":""},{"$f":"IF(D33<>\"\",VLOOKUP(D33,Asiakkaat!$A$2:$E$394,5,FALSE)*2,\"\")","v":""},{"$f":"IF(D33<>\"\",H33*Parametrit!$B$6,\"\")","v":""},null,null,{"$f":"IF((J33*Parametrit!$B$4)+(K33*Parametrit!$B$5)=0,\"\",(J33*Parametrit!$B$4)+(K33*Parametrit!$B$5))","v":""},null,{"$f":"IF(A33<>\"\",I33+(J33*Parametrit!$B$4)+(K33*Parametrit!$B$5)+M33,\"\")","v":""}]
[null,"",{"$f":"IF(D34<>\"\",VLOOKUP(D34,Asiakkaat!$A$2:$E$244,2,FALSE),\"\")","v":""},null,null,{"$f":"IF(D34<>\"\",VLOOKUP(D34,Asiakkaat!$A$2:$E$244,3,FALSE),\"\")","v":""},{"$f":"IF(D34<>\"\",VLOOKUP(D34,Asiakkaat!$A$2:$E$100,4,FALSE),\"\")","v":""},{"$f":"IF(D34<>\"\",VLOOKUP(D34,Asiakkaat!$A$2:$E$394,5,FALSE)*2,\"\")","v":""},{"$f":"IF(D34<>\"\",H34*Parametrit!$B$6,\"\")","v":""},null,null,{"$f":"IF((J34*Parametrit!$B$4)+(K34*Parametrit!$B$5)=0,\"\",(J34*Parametrit!$B$4)+(K34*Parametrit!$B$5))","v":""},null,{"$f":"IF(A34<>\"\",I34+(J34*Parametrit!$B$4)+(K34*Parametrit!$B$5)+M34,\"\")","v":""}]
[null,{"$f":"IF(A35<>\"\",IFERROR(WEEKDAY(A35),\"\"),\"\")","v":""},{"$f":"IF(D35<>\"\",VLOOKUP(D35,Asiakkaat!$A$2:$E$244,2,FALSE),\"\")","v":""},null,null,{"$f":"IF(D35<>\"\",VLOOKUP(D35,Asiakkaat!$A$2:$E$244,3,FALSE),\"\")","v":""},{"$f":"IF(D35<>\"\",VLOOKUP(D35,Asiakkaat!$A$2:$E$100,4,FALSE),\"\")","v":""},{"$f":"IF(D35<>\"\",VLOOKUP(D35,Asiakkaat!$A$2:$E$394,5,FALSE)*2,\"\")","v":""},{"$f":"IF(D35<>\"\",H35*Parametrit!$B$6,\"\")","v":""},null,null,{"$f":"IF((J35*Parametrit!$B$4)+(K35*Parametrit!$B$5)=0,\"\",(J35*Parametrit!$B$4)+(K35*Parametrit!$B$5))","v":""},null,{"$f":"IF(A35<>\"\",I35+(J35*Parametrit!$B$4)+(K35*Parametrit!$B$5)+M35,\"\")","v":""}]
[null,"",{"$f":"IF(D36<>\"\",VLOOKUP(D36,Asiakkaat!$A$2:$E$244,2,FALSE),\"\")","v":""},null,null,{"$f":"IF(D36<>\"\",VLOOKUP(D36,Asiakkaat!$A$2:$E$244,3,FALSE),\"\")","v":""},{"$f":"IF(D36<>\"\",VLOOKUP(D36,Asiakkaat!$A$2:$E$100,4,FALSE),\"\")","v":""},{"$f":"IF(D36<>\"\",VLOOKUP(D36,Asiakkaat!$A$2:$E$394,5,FALSE)*2,\"\")","v":""},{"$f":"IF(D36<>\"\",H36*Parametrit!$B$6,\"\")","v":""},null,null,{"$f":"IF((J36*Parametrit!$B$4)+(K36*Parametrit!$B$5)=0,\"\",(J36*Parametrit!$B$4)+(K36*Parametrit!$B$5))","v":""},null,{"$f":"IF(A36<>\"\",I36+(J36*Parametrit!$B$4)+(K36*Parametrit!$B$5)+M36,\"\")","v":""}]
[null,"",{"$f":"IF(D37<>\"\",VLOOKUP(D37,Asiakkaat!$A$2:$E$244,2,FALSE),\"\")","v":""},null,null,{"$f":"IF(D37<>\"\",VLOOKUP(D37,Asiakkaat!$A$2:$E$244,3,FALSE),\"\")","v":""},{"$f":"IF(D37<>\"\",VLOOKUP(D37,Asiakkaat!$A$2:$E$100,4,FALSE),\"\")","v":""},{"$f":"IF(D37<>\"\",VLOOKUP(D37,Asiakkaat!$A$2:$E$394,5,FALSE)*2,\"\")","v":""},{"$f":"IF(D37<>\"\",H37*Parametrit!$B$6,\"\")","v":""},null,null,{"$f":"IF((J37*Parametrit!$B$4)+(K37*Parametrit!$B$5)=0,\"\",(J37*Parametrit!$B$4)+(K37*Parametrit!$B$5))","v":""},null,{"$f":"IF(A37<>\"\",I37+(J37*Parametrit!$B$4)+(K37*Parametrit!$B$5)+M37,\"\")","v":""}]
[null,"",{"$f":"IF(D38<>\"\",VLOOKUP(D38,Asiakkaat!$A$2:$E$244,2,FALSE),\"\")","v":""},null,null,{"$f":"IF(D38<>\"\",VLOOKUP(D38,Asiakkaat!$A$2:$E$244,3,FALSE),\"\")","v":""},{"$f":"IF(D38<>\"\",VLOOKUP(D38,Asiakkaat!$A$2:$E$100,4,FALSE),\"\")","v":""},{"$f":"IF(D38<>\"\",VLOOKUP(D38,Asiakkaat!$A$2:$E$394,5,FALSE)*2,\"\")","v":""},{"$f":"IF(D38<>\"\",H38*Parametrit!$B$6,\"\")","v":""},null,null,{"$f":"IF((J38*Parametrit!$B$4)+(K38*Parametrit!$B$5)=0,\"\",(J38*Parametrit!$B$4)+(K38*Parametrit!$B$5))","v":""},null,{"$f":"IF(A38<>\"\",I38+(J38*Parametrit!$B$4)+(K38*Parametrit!$B$5)+M38,\"\")","v":""}]
[null,"",{"$f":"IF(D39<>\"\",VLOOKUP(D39,Asiakkaat!$A$2:$E$244,2,FALSE),\"\")","v":""},null,null,{"$f":"IF(D39<>\"\",VLOOKUP(D39,Asiakkaat!$A$2:$E$244,3,FALSE),\"\")","v":""},{"$f":"IF(D39<>\"\",VLOOKUP(D39,Asiakkaat!$A$2:$E$100,4,FALSE),\"\")","v":""},{"$f":"IF(D39<>\"\",VLOOKUP(D39,Asiakkaat!$A$2:$E$394,5,FALSE)*2,\"\")","v":""},{"$f":"IF(D39<>\"\",H39*Parametrit!$B$6,\"\")","v":""},null,null,{"$f":"IF((J39*Parametrit!$B$4)+(K39*Parametrit!$B$5)=0,\"\",(J39*Parametrit!$B$4)+(K39*Parametrit!$B$5))","v":""},null,{"$f":"IF(A39<>\"\",I39+(J39*Parametrit!$B$4)+(K39*Parametrit!$B$5)+M39,\"\")","v":""}]
[null,"",{"$f":"IF(D40<>\"\",VLOOKUP(D40,Asiakkaat!$A$2:$E$244,2,FALSE),\"\")","v":""},null,null,{"$f":"IF(D40<>\"\",VLOOKUP(D40,Asiakkaat!$A$2:$E$244,3,FALSE),\"\")","v":""},{"$f":"IF(D40<>\"\",VLOOKUP(D40,Asiakkaat!$A$2:$E$100,4,FALSE),\"\")","v":""},{"$f":"IF(D40<>\"\",VLOOKUP(D40,Asiakkaat!$A$2:$E$394,5,FALSE)*2,\"\")","v":""},{"$f":"IF(D40<>\"\",H40*Parametrit!$B$6,\"\")","v":""},null,null,{"$f":"IF((J40*Parametrit!$B$4)+(K40*Parametrit!$B$5)=0,\"\",(J40*Parametrit!$B$4)+(K40*Parametrit!$B$5))","v":""},null,{"$f":"IF(A40<>\"\",I40+(J40*Parametrit!$B$4)+(K40*Parametrit!$B$5)+M40,\"\")","v":""}]
{"$rows_left_out":119}